BDBM185361 US9156831, 1
SMILES Cn1nc(nc1-c1cnc(N)c(n1)-c1nnc(o1)C(C)(C)C)C1CCN(CC1)C(=O)CCO
InChI Key InChIKey=BICOKLIHOJCQPA-UHFFFAOYSA-N
Data  5 IC50
  Tab Delimited (TSV)   2D SDfile   Computed 3D by Vconf -m prep SDfile
Find this compound or compounds like it in BindingDB:
Activity Spreadsheet -- Enzyme Inhibition Constant Data from BindingDB
Found 5 hits for monomerid = 185361
LigandPNGBDBM185361(US9156831, 1)
Affinity DataIC50:  23nMT: 2°C. Assay description: The inhibition of PI3K-beta, PI3K-alpha, PI3K-gamma and PI3K-delta was evaluated in a Kinase Glo based enzyme activity assay using human recombinant ...
In DepthDetails US Patent
LigandPNGBDBM185361(US9156831, 1)
Affinity DataIC50: <14nMT: 2°C. Assay description: The inhibition of PI3K-beta, PI3K-alpha, PI3K-gamma and PI3K-delta was evaluated in a Kinase Glo based enzyme activity assay using human recombinant ...
In DepthDetails US Patent
TargetSerine/threonine-protein kinase ATR(Homo sapiens (Human))
Astrazeneca
US Patent
LigandPNGBDBM185361(US9156831, 1)
Affinity DataIC50: >3.00E+4nM. Assay description: ATR (Ataxia Telangiectasia+Rad3-related kinase) is a PI3-kinase-related kinase which phosphorylates multiple substrates on serine or threonine residu...
In DepthDetails US Patent
LigandPNGBDBM185361(US9156831, 1)
Affinity DataIC50:  360nMT: 2°C. Assay description: This assay was used to measure PI3K-alpha inhibition in cells. BT474 cells (human breast ductal carcinoma, ATCC HTB-20) were seeded into black 384 we...
In DepthDetails US Patent
LigandPNGBDBM185361(US9156831, 1)
Affinity DataIC50:  2.24E+3nMT: 2°C. Assay description: The inhibition of PI3K-beta, PI3K-alpha, PI3K-gamma and PI3K-delta was evaluated in a Kinase Glo based enzyme activity assay using human recombinant ...
In DepthDetails US Patent