BDBM18592 6-[(2,2,3,3,3-pentafluoropropyl)(2,2,2-trifluoroethyl)amino]-4-(trifluoromethyl)-1,2-dihydroquinolin-2-one::6-bisalkylamino-2-quinolinone, 6q
SMILES FC(F)(F)CN(CC(F)(F)C(F)(F)F)c1ccc2[nH]c(=O)cc(c2c1)C(F)(F)F
InChI Key InChIKey=OAGSIVDGPGETCO-UHFFFAOYSA-N
Data  1 KI  1 EC50
  Tab Delimited (TSV)   2D SDfile   Computed 3D by Vconf -m prep SDfile
Find this compound or compounds like it in BindingDB:
Activity Spreadsheet -- Enzyme Inhibition Constant Data from BindingDB
Found 1 hit for monomerid = 18592
TargetAndrogen receptor(Homo sapiens (Human))
Ligand Pharmaceuticals
LigandPNGBDBM18592(6-[(2,2,3,3,3-pentafluoropropyl)(2,2,2-trifluoroet...)
Affinity DataKi:  31nM ΔG°:  -10.6kcal/mole EC50:  2.30nMpH: 7.4 T: 2°C. Assay description: The compounds were evaluated in a transcriptional activation assay with hAR in a mammalian cell background (CV-1) as the primary in vitro assay. Rece...
In DepthDetails ArticlePubMed