BDBM18607 6-[bis(2,2,2-trifluoroethyl)amino]-4-bromo-1,2-dihydroquinolin-2-one::6-bisalkylamino-2-quinolinone, 7h
SMILES FC(F)(F)CN(CC(F)(F)F)c1ccc2[nH]c(=O)cc(Br)c2c1
InChI Key InChIKey=OVFZJKAKVGZHJD-UHFFFAOYSA-N
Data  1 KI  1 EC50
  Tab Delimited (TSV)   2D SDfile   Computed 3D by Vconf -m prep SDfile
Find this compound or compounds like it in BindingDB:
Activity Spreadsheet -- Enzyme Inhibition Constant Data from BindingDB
Found 1 hit for monomerid = 18607
TargetAndrogen receptor(Homo sapiens (Human))
Ligand Pharmaceuticals
LigandPNGBDBM18607(6-[bis(2,2,2-trifluoroethyl)amino]-4-bromo-1,2-dih...)
Affinity DataKi:  0.5nM EC50:  1nM. Assay description: The compounds were evaluated in a transcriptional activation assay with hAR in a mammalian cell background (CV-1) as the primary in vitro assay. Rece...
Ligand InfoPC cidPC sid
In DepthDetails ArticlePubMed