BDBM187119 US9670203, Compound 1.34
SMILES COc1ccc(NC(=O)N[C@@H]2[C@H]3Oc4ccc(Oc5ccnc6NC(=O)CCc56)cc4[C@@H]23)cc1C(F)(F)F
InChI Key InChIKey=DKQHATLVCWTYHV-VABKMULXSA-N
Data  1 IC50
  Tab Delimited (TSV)   2D SDfile   Computed 3D by Vconf -m prep SDfile
Find this compound or compounds like it in BindingDB:
Activity Spreadsheet -- Enzyme Inhibition Constant Data from BindingDB
Found 1 hit for monomerid = 187119
TargetSerine/threonine-protein kinase B-raf [416-766,V600E](Homo sapiens (Human))
Beigene
US Patent
LigandPNGBDBM187119(US9670203, Compound 1.34)
Affinity DataIC50:  1.26E+4nMT: 2°C. Assay description: Compounds disclosed herein were tested against B-Raf (V600E) (PV3849, from Invitrogen) or C-Raf (Y340D/Y341D) (PV3805, from Invitrogen) in a time-res...
Ligand InfoPC cidPC sid
In DepthDetails US Patent