BDBM1872 1-(2-phenylethyl)-3-(4-propyl-1,3-thiazol-2-yl)thiourea::N-(2-Phenethyl)-N -(2-(4-propylthiazolyl))thiourea::PETT Analog 39
SMILES CCCc1csc(NC(=S)NCCc2ccccc2)n1
InChI Key InChIKey=YVTPTTMDIAAXHM-UHFFFAOYSA-N
Data  1 IC50
  Tab Delimited (TSV)   2D SDfile   Computed 3D by Vconf -m prep SDfile
Find this compound or compounds like it in BindingDB:
Activity Spreadsheet -- Enzyme Inhibition Constant Data from BindingDB
Found 1 hit for monomerid = 1872
TargetGag-Pol polyprotein [588-1027]/[588-1147](Human immunodeficiency virus type 1)
Eli Lilly
LigandPNGBDBM1872(1-(2-phenylethyl)-3-(4-propyl-1,3-thiazol-2-yl)thi...)
Affinity DataIC50:  350nMpH: 7.8 T: 2°C. Assay description: The IC50 of reverse transcriptase is the concentration that inhibits 50% of recombinant HIV-1 RT RNA-directed DNA polymerase activity in vitro.
In DepthDetails ArticlePubMed