BDBM18789 6-methyl-5-phenylpyrimidine-2,4-diamine::CHEMBL21408::P36
SMILES Cc1nc(N)nc(N)c1-c1ccccc1
InChI Key InChIKey=RBOOBZAJMOATAV-UHFFFAOYSA-N
Data  6 KI  3 IC50
  Tab Delimited (TSV)   2D SDfile   Computed 3D by Vconf -m prep SDfile
Find this compound or compounds like it in BindingDB:
Activity Spreadsheet -- Enzyme Inhibition Constant Data from BindingDB
Found 7 hits for monomerid = 18789
TargetBifunctional dihydrofolate reductase-thymidylate synthase(Plasmodium vivax (malaria parasite P. vivax))
National Center For Genetic Engineering And Biotechnology At Thailand
LigandPNGBDBM18789(6-methyl-5-phenylpyrimidine-2,4-diamine | CHEMBL21...)
Affinity DataKi:  4.18nM ΔG°:  -11.4kcal/mole IC50:  1.13E+4nMpH: 7.0 T: 2°C. Assay description: Nineteen Pyr analogs were studied for their inhibition activity against cells expressing either WT or SP21 mutant PvDHFR-TS. The assays were conducte...
In DepthDetails ArticlePubMed
TargetBifunctional dihydrofolate reductase-thymidylate synthase(Plasmodium falciparum (isolate K1 / Thailand))
National Center For Genetic Engineering And Biotechnology At Thailand
Curated by ChEMBL
LigandPNGBDBM18789(6-methyl-5-phenylpyrimidine-2,4-diamine | CHEMBL21...)
Affinity DataKi:  10.9nM. Assay description: Inhibition of the wild-type dihydrofolate reductase (DHFR)
In DepthDetails ArticlePubMed
TargetBifunctional dihydrofolate reductase-thymidylate synthase [1-238,S58R,S117N](Plasmodium vivax (malaria parasite P. vivax))
National Center For Genetic Engineering And Biotechnology At Thailand
LigandPNGBDBM18789(6-methyl-5-phenylpyrimidine-2,4-diamine | CHEMBL21...)
Affinity DataKi:  22.5nM IC50:  1.29E+4nM. Assay description: Nineteen Pyr analogs were studied for their inhibition activity against cells expressing either WT or SP21 mutant PvDHFR-TS. The assays were conducte...
In DepthDetails ArticlePubMed
TargetBifunctional dihydrofolate reductase-thymidylate synthase(Plasmodium falciparum (isolate K1 / Thailand))
National Center For Genetic Engineering And Biotechnology At Thailand
Curated by ChEMBL
LigandPNGBDBM18789(6-methyl-5-phenylpyrimidine-2,4-diamine | CHEMBL21...)
Affinity DataKi:  25.6nM. Assay description: Inhibition of the S108N mutant of dihydrofolate reductase (DHFR)
In DepthDetails ArticlePubMed
TargetBifunctional dihydrofolate reductase-thymidylate synthase(Plasmodium falciparum (isolate K1 / Thailand))
National Center For Genetic Engineering And Biotechnology At Thailand
Curated by ChEMBL
LigandPNGBDBM18789(6-methyl-5-phenylpyrimidine-2,4-diamine | CHEMBL21...)
Affinity DataKi:  36.7nM. Assay description: Inhibition of the C59R+S108N mutant of dihydrofolate reductase (DHFR)
In DepthDetails ArticlePubMed
TargetBifunctional dihydrofolate reductase-thymidylate synthase(Plasmodium falciparum (isolate K1 / Thailand))
National Center For Genetic Engineering And Biotechnology At Thailand
Curated by ChEMBL
LigandPNGBDBM18789(6-methyl-5-phenylpyrimidine-2,4-diamine | CHEMBL21...)
Affinity DataKi:  110nM. Assay description: Inhibition constant against Plasmodium falciparum dihydrofolate reductaseChecked by Author
In DepthDetails ArticlePubMed
TargetBifunctional dihydrofolate reductase-thymidylate synthase(Plasmodium falciparum (isolate K1 / Thailand))
National Center For Genetic Engineering And Biotechnology At Thailand
Curated by ChEMBL
LigandPNGBDBM18789(6-methyl-5-phenylpyrimidine-2,4-diamine | CHEMBL21...)
Affinity DataIC50:  3.08E+4nM. Assay description: Antiplasmodial activity (IC50) against Plasmodium falciparum Clone with mutant enzyme C59R+S108N- pfDihydrofolate reductase (K1CB1)
In DepthDetails ArticlePubMed