BDBM1884 3-(3-bromopyridin-2-yl)-1-(2-phenylethyl)thiourea::N-(2-Phenethyl)-N -(2-(3-bromopyridyl))thiourea::PETT Analog 51
SMILES Brc1cccnc1NC(=S)NCCc1ccccc1
InChI Key InChIKey=KBHZHOONHFJSKI-UHFFFAOYSA-N
Data  1 IC50
  Tab Delimited (TSV)   2D SDfile   Computed 3D by Vconf -m prep SDfile
Find this compound or compounds like it in BindingDB:
Activity Spreadsheet -- Enzyme Inhibition Constant Data from BindingDB
Found 1 hit for monomerid = 1884
TargetGag-Pol polyprotein [588-1027]/[588-1147](Human immunodeficiency virus type 1)
Eli Lilly
LigandPNGBDBM1884(3-(3-bromopyridin-2-yl)-1-(2-phenylethyl)thiourea ...)
Affinity DataIC50: >1.00E+4nMpH: 7.8 T: 2°C. Assay description: The IC50 of reverse transcriptase is the concentration that inhibits 50% of recombinant HIV-1 RT RNA-directed DNA polymerase activity in vitro.
In DepthDetails ArticlePubMed