BDBM188712 US9169246, 254
SMILES FC(F)(F)Cn1c2cc(ccc2c2[nH]ncc2c1=O)-c1cccnc1N1CCC1
InChI Key InChIKey=SWEFIISHSBBBSS-UHFFFAOYSA-N
Data  1 IC50
  Tab Delimited (TSV)   2D SDfile   Computed 3D by Vconf -m prep SDfile
Find this compound or compounds like it in BindingDB:
Activity Spreadsheet -- Enzyme Inhibition Constant Data from BindingDB
Found 1 hit for monomerid = 188712
TargetMethionine aminopeptidase 2(Homo sapiens (Human))
Sanofi
US Patent
LigandPNGBDBM188712(US9169246, 254)
Affinity DataIC50:  13nM. Assay description: The enzymatic test is a test in two steps.In a first step, it consists in placing in contact the compound according to the invention, the dialysed Me...
In DepthDetails US Patent