BDBM188720 US9169246, 262
SMILES CC(C)N(C)c1ncccc1-c1ccc2c3n[nH]cc3c(=O)n(CC(F)(F)F)c2c1
InChI Key InChIKey=WJLGGSYKNRHPNY-UHFFFAOYSA-N
Data  1 IC50
  Tab Delimited (TSV)   2D SDfile   Computed 3D by Vconf -m prep SDfile
Find this compound or compounds like it in BindingDB:
Activity Spreadsheet -- Enzyme Inhibition Constant Data from BindingDB
Found 1 hit for monomerid = 188720
TargetMethionine aminopeptidase 2(Homo sapiens (Human))
Sanofi
US Patent
LigandPNGBDBM188720(US9169246, 262)
Affinity DataIC50:  86nM. Assay description: The enzymatic test is a test in two steps.In a first step, it consists in placing in contact the compound according to the invention, the dialysed Me...
In DepthDetails US Patent