BDBM189825 US9670203, Compound 1.53
SMILES Fc1cc(F)c(F)c(NC(=O)N[C@@H]2[C@H]3Oc4ccc(Oc5ccnc6NC(=O)CCc56)cc4[C@@H]23)c1
InChI Key InChIKey=CFBHEDCJEICUQJ-BVSLBCMMSA-N
Data  1 IC50
  Tab Delimited (TSV)   2D SDfile   Computed 3D by Vconf -m prep SDfile
Find this compound or compounds like it in BindingDB:
Activity Spreadsheet -- Enzyme Inhibition Constant Data from BindingDB
Found 1 hit for monomerid = 189825
TargetSerine/threonine-protein kinase B-raf [416-766,V600E](Homo sapiens (Human))
Beigene
US Patent
LigandPNGBDBM189825(US9670203, Compound 1.53)
Affinity DataIC50:  2.90E+3nMT: 2°C. Assay description: Compounds disclosed herein were tested against B-Raf (V600E) (PV3849, from Invitrogen) or C-Raf (Y340D/Y341D) (PV3805, from Invitrogen) in a time-res...
Ligand InfoPC cidPC sid
In DepthDetails US Patent