BDBM190368 US9180122, 3
SMILES Cc1ccc(CSc2c[nH]c(=O)c(O)c2)cc1
InChI Key InChIKey=WSOOJEKUDGHUPJ-UHFFFAOYSA-N
Data  1 IC50
  Tab Delimited (TSV)   2D SDfile   Computed 3D by Vconf -m prep SDfile
Find this compound or compounds like it in BindingDB:
Activity Spreadsheet -- Enzyme Inhibition Constant Data from BindingDB
Found 1 hit for monomerid = 190368
TargetD-amino-acid oxidase(Homo sapiens (Human))
Takeda Pharmaceutical
US Patent
LigandPNGBDBM190368(US9180122, 3)
Affinity DataIC50:  29nM. Assay description: The functional activity of compounds inhibiting the DAAO enzyme was determined by utilizing the co-product of the catalysis of D-Serine, H2O2 which c...
In DepthDetails US Patent