BDBM190372 US9180122, 7
SMILES Oc1cc(SCc2ccccc2Cl)c[nH]c1=O
InChI Key InChIKey=UIZSLXWPXZEQDK-UHFFFAOYSA-N
Data  1 IC50
  Tab Delimited (TSV)   2D SDfile   Computed 3D by Vconf -m prep SDfile
Find this compound or compounds like it in BindingDB:
Activity Spreadsheet -- Enzyme Inhibition Constant Data from BindingDB
Found 1 hit for monomerid = 190372
TargetD-amino-acid oxidase(Homo sapiens (Human))
Takeda Pharmaceutical
US Patent
LigandPNGBDBM190372(US9180122, 7)
Affinity DataIC50:  210nM. Assay description: The functional activity of compounds inhibiting the DAAO enzyme was determined by utilizing the co-product of the catalysis of D-Serine, H2O2 which c...
In DepthDetails US Patent