BDBM190540 US9181184, 27
SMILES CCCCOc1ccc(CN2C[C@H](O)[C@@H](O)[C@H](O)[C@H]2CO)cc1
InChI Key InChIKey=KRANEQWPXTUBEZ-YYIAUSFCSA-N
Data  1 EC50
  Tab Delimited (TSV)   2D SDfile   Computed 3D by Vconf -m prep SDfile
Find this compound or compounds like it in BindingDB:
Activity Spreadsheet -- Enzyme Inhibition Constant Data from BindingDB
Found 1 hit for monomerid = 190540
TargetLysosomal alpha-glucosidase(Mus musculus (Mouse))
Amicus Therapeutics
US Patent
LigandPNGBDBM190540(US9181184, 27)
Affinity DataEC50:  1.73E+4nMpH: 4.0Assay Description:Cells were washed two times with 200 μL dPBS followed by the addition of 70 μL of substrate (2.11 mM 3 mM 4-MU-α-D-glu) in citrate-pho...
In DepthDetails US Patent