BDBM190805 US9670203, Compound 1.67
SMILES O=C(N[C@@H]1[C@H]2Oc3ccc(Oc4ccnc5NC(=O)CCc45)cc3[C@@H]12)NC1CCOCC1
InChI Key InChIKey=INWSTOUQOSEXMH-ACRUOGEOSA-N
Data  1 IC50
  Tab Delimited (TSV)   2D SDfile   Computed 3D by Vconf -m prep SDfile
Find this compound or compounds like it in BindingDB:
Activity Spreadsheet -- Enzyme Inhibition Constant Data from BindingDB
Found 1 hit for monomerid = 190805
TargetSerine/threonine-protein kinase B-raf [416-766,V600E](Homo sapiens (Human))
Beigene
US Patent
LigandPNGBDBM190805(US9670203, Compound 1.67)
Affinity DataIC50:  4.20E+3nMT: 2°C. Assay description: Compounds disclosed herein were tested against B-Raf (V600E) (PV3849, from Invitrogen) or C-Raf (Y340D/Y341D) (PV3805, from Invitrogen) in a time-res...
Ligand InfoPC cidPC sid
In DepthDetails US Patent