BDBM190906 US10077266, Example 17::US9181249, 17::US9708313, 17
SMILES CC(C)Nc1nc2CCN(Cc2nc1N1CCC(CC1)Oc1ccc(F)cc1F)C(=O)CC#N
InChI Key InChIKey=MEZHRZNUBYRNCA-UHFFFAOYSA-N
Data  3 IC50
  Tab Delimited (TSV)   2D SDfile   Computed 3D by Vconf -m prep SDfile
Find this compound or compounds like it in BindingDB:
Activity Spreadsheet -- Enzyme Inhibition Constant Data from BindingDB
Found 3 hits for monomerid = 190906
TargetG-protein coupled receptor 6(Homo sapiens (Human))
Takeda Pharmaceutical
US Patent
LigandPNGBDBM190906(US10077266, Example 17 | US9181249, 17 | US9708313...)
Affinity DataIC50:  0.0180nMT: 2°C. Assay description: This cell based assay measures the ability of compounds to inhibit the constitutive cAMP activity of GPR6 receptor expressed in CHO-K1 cells. CHO cel...
In DepthDetails US Patent
TargetG-protein coupled receptor 6(Homo sapiens (Human))
Takeda Pharmaceutical
US Patent
LigandPNGBDBM190906(US10077266, Example 17 | US9181249, 17 | US9708313...)
Affinity DataIC50:  1.80E+4nM. Assay description: Inhibition of cAMP Activity of GPR6 In Vitro AssayThis cell based assay measures the ability of compounds to inhibit the constitutive cAMP activity o...
In DepthDetails US Patent
TargetG-protein coupled receptor 6(Homo sapiens (Human))
Takeda Pharmaceutical
US Patent
LigandPNGBDBM190906(US10077266, Example 17 | US9181249, 17 | US9708313...)
Affinity DataIC50:  1.80E+4nM. Assay description: This cell based assay measures the ability of compounds to inhibit the constitutive cAMP activity of GPR6 receptor expressed in CHO-K1 cells. CHO cel...
In DepthDetails US Patent