BDBM190986 US10077266, Example 99::US9181249, 99::US9708313, 99
SMILES CO[C@@H](C)C(=O)N1CCc2nc(NCC(F)F)c(nc2C1)N1CCC(CC1)Oc1ccc(F)cc1F
InChI Key InChIKey=FQWWKVZBYLUHMI-AWEZNQCLSA-N
Data  3 IC50
  Tab Delimited (TSV)   2D SDfile   Computed 3D by Vconf -m prep SDfile
Find this compound or compounds like it in BindingDB:
Activity Spreadsheet -- Enzyme Inhibition Constant Data from BindingDB
Found 3 hits for monomerid = 190986
TargetG-protein coupled receptor 6(Homo sapiens (Human))
Takeda Pharmaceutical
US Patent
LigandPNGBDBM190986(US10077266, Example 99 | US9181249, 99 | US9708313...)
Affinity DataIC50:  0.00830nMT: 2°C. Assay description: This cell based assay measures the ability of compounds to inhibit the constitutive cAMP activity of GPR6 receptor expressed in CHO-K1 cells. CHO cel...
In DepthDetails US Patent
TargetG-protein coupled receptor 6(Homo sapiens (Human))
Takeda Pharmaceutical
US Patent
LigandPNGBDBM190986(US10077266, Example 99 | US9181249, 99 | US9708313...)
Affinity DataIC50:  8.30E+3nM. Assay description: Inhibition of cAMP Activity of GPR6 In Vitro AssayThis cell based assay measures the ability of compounds to inhibit the constitutive cAMP activity o...
In DepthDetails US Patent
TargetG-protein coupled receptor 6(Homo sapiens (Human))
Takeda Pharmaceutical
US Patent
LigandPNGBDBM190986(US10077266, Example 99 | US9181249, 99 | US9708313...)
Affinity DataIC50:  8.30E+3nM. Assay description: This cell based assay measures the ability of compounds to inhibit the constitutive cAMP activity of GPR6 receptor expressed in CHO-K1 cells. CHO cel...
In DepthDetails US Patent