BDBM190998 US10077266, Example 111::US9181249, 111::US9708313, 111
SMILES COCC(=O)N1Cc2nc(N3CCC(CC3)Oc3ccc(F)cc3F)c(NCC(F)F)nc2CC1C
InChI Key InChIKey=WMGUSMNEKHKMHA-UHFFFAOYSA-N
Data  3 IC50
  Tab Delimited (TSV)   2D SDfile   Computed 3D by Vconf -m prep SDfile
Find this compound or compounds like it in BindingDB:
Activity Spreadsheet -- Enzyme Inhibition Constant Data from BindingDB
Found 3 hits for monomerid = 190998
TargetG-protein coupled receptor 6(Homo sapiens (Human))
Takeda Pharmaceutical
US Patent
LigandPNGBDBM190998(US10077266, Example 111 | US9181249, 111 | US97083...)
Affinity DataIC50:  0.0230nMT: 2°C. Assay description: This cell based assay measures the ability of compounds to inhibit the constitutive cAMP activity of GPR6 receptor expressed in CHO-K1 cells. CHO cel...
In DepthDetails US Patent
TargetG-protein coupled receptor 6(Homo sapiens (Human))
Takeda Pharmaceutical
US Patent
LigandPNGBDBM190998(US10077266, Example 111 | US9181249, 111 | US97083...)
Affinity DataIC50:  2.30E+4nM. Assay description: Inhibition of cAMP Activity of GPR6 In Vitro AssayThis cell based assay measures the ability of compounds to inhibit the constitutive cAMP activity o...
In DepthDetails US Patent
TargetG-protein coupled receptor 6(Homo sapiens (Human))
Takeda Pharmaceutical
US Patent
LigandPNGBDBM190998(US10077266, Example 111 | US9181249, 111 | US97083...)
Affinity DataIC50:  2.30E+4nM. Assay description: This cell based assay measures the ability of compounds to inhibit the constitutive cAMP activity of GPR6 receptor expressed in CHO-K1 cells. CHO cel...
In DepthDetails US Patent