BDBM191050 US9181253, 110
SMILES O[C@H]1C[C@]2(C[C@H]2[C@H]1O)n1cnc2c(NC3CCCCC3)nc(Cl)nc12
InChI Key InChIKey=FBEAKVULROEXMT-ORMQQPANSA-N
Data  3 KI
  Tab Delimited (TSV)   2D SDfile   Computed 3D by Vconf -m prep SDfile
Find this compound or compounds like it in BindingDB:
Activity Spreadsheet -- Enzyme Inhibition Constant Data from BindingDB
Found 3 hits for monomerid = 191050
TargetAdenosine receptor A1(Homo sapiens (Human))
The United States Of America, As Represented By The Secretary, Department Of Health And Human Services
US Patent
LigandPNGBDBM191050(US9181253, 110)
Affinity DataKi:  140nM ΔG°:  -9.34kcal/molepH: 7.5 T: 2°C. Assay description: Radioligand binding assays at A1, A2A, and A3ARs were performed according to the procedures described previously. Each tube in the binding assay cont...
In DepthDetails US Patent
TargetAdenosine receptor A3 [I248L](Homo sapiens (Human))
The United States Of America, As Represented By The Secretary, Department Of Health And Human Services
US Patent
LigandPNGBDBM191050(US9181253, 110)
Affinity DataKi:  500nM ΔG°:  -8.59kcal/molepH: 7.5 T: 2°C. Assay description: Radioligand binding assays at A1, A2A, and A3ARs were performed according to the procedures described previously. Each tube in the binding assay cont...
In DepthDetails US Patent
TargetAdenosine receptor A2a(Homo sapiens (Human))
The United States Of America, As Represented By The Secretary, Department Of Health And Human Services
US Patent
LigandPNGBDBM191050(US9181253, 110)
Affinity DataKi:  2.72E+3nM ΔG°:  -7.59kcal/molepH: 7.5 T: 2°C. Assay description: Radioligand binding assays at A1, A2A, and A3ARs were performed according to the procedures described previously. Each tube in the binding assay cont...
In DepthDetails US Patent