BDBM191062 US9181253, 124
SMILES CCOc1ccccc1CNc1nc(Cl)nc2n(cnc12)[C@]12C[C@H]1[C@@H](O)[C@@H](O)C2
InChI Key InChIKey=XWCRMZLTCANGMV-YDYCPSOVSA-N
Data  1 KI
  Tab Delimited (TSV)   2D SDfile   Computed 3D by Vconf -m prep SDfile
Find this compound or compounds like it in BindingDB:
Activity Spreadsheet -- Enzyme Inhibition Constant Data from BindingDB
Found 1 hit for monomerid = 191062
TargetAdenosine receptor A3 [I248L](Homo sapiens (Human))
The United States Of America, As Represented By The Secretary, Department Of Health And Human Services
US Patent
LigandPNGBDBM191062(US9181253, 124)
Affinity DataKi:  15.2nM ΔG°:  -10.7kcal/molepH: 7.5 T: 2°C. Assay description: Radioligand binding assays at A1, A2A, and A3ARs were performed according to the procedures described previously. Each tube in the binding assay cont...
In DepthDetails US Patent