BDBM1916 1-[2-(2,6-difluorophenyl)ethyl]-3-1,3-thiazol-2-ylthiourea::N-(2-(2,6-Difluorophenethyl))-N -(2-thiazolyl)thiourea::PETT Analog 23
SMILES Fc1cccc(F)c1CCNC(=S)Nc1nccs1
InChI Key InChIKey=BLZZAJBLYALRNA-UHFFFAOYSA-N
Data  1 IC50
  Tab Delimited (TSV)   2D SDfile   Computed 3D by Vconf -m prep SDfile
Find this compound or compounds like it in BindingDB:
Activity Spreadsheet -- Enzyme Inhibition Constant Data from BindingDB
Found 1 hit for monomerid = 1916
TargetGag-Pol polyprotein [588-1027]/[588-1147](Human immunodeficiency virus type 1)
Eli Lilly
LigandPNGBDBM1916(1-[2-(2,6-difluorophenyl)ethyl]-3-1,3-thiazol-2-yl...)
Affinity DataIC50:  10nM. Assay description: The IC50 of reverse transcriptase is the concentration that inhibits 50% of recombinant HIV-1 RT RNA-directed DNA polymerase activity in vitro.
In DepthDetails ArticlePubMed