BDBM191828 US9187428, 56
SMILES CNC(=O)c1cc(ccn1)C(C)Sc1nc(N)c(C#N)c(-c2ccc(OCC(F)(F)F)cc2)c1C#N
InChI Key InChIKey=SDZLWPSMPSPGFW-UHFFFAOYSA-N
Data  3 EC50
  Tab Delimited (TSV)   2D SDfile   Computed 3D by Vconf -m prep SDfile
Find this compound or compounds like it in BindingDB:
Activity Spreadsheet -- Enzyme Inhibition Constant Data from BindingDB
Found 3 hits for monomerid = 191828
TargetAdenosine receptor A1(Homo sapiens (Human))
Bayer Intellectual Property
US Patent
LigandPNGBDBM191828(US9187428, 56)
Affinity DataEC50:  2.80nMpH: 7.4 T: 2°C. Assay description: The following test protocol is used for pharmacologically characterizing cells and for the robot-assisted substance screening:The stock cultures ar...
In DepthDetails US Patent
TargetAdenosine receptor A2b(Homo sapiens (Human))
Bayer Intellectual Property
US Patent
LigandPNGBDBM191828(US9187428, 56)
Affinity DataEC50:  3.00E+3nMpH: 7.4 T: 2°C. Assay description: The following test protocol is used for pharmacologically characterizing cells and for the robot-assisted substance screening:The stock cultures ar...
In DepthDetails US Patent
TargetAdenosine receptor A2a(Homo sapiens (Human))
Bayer Intellectual Property
US Patent
LigandPNGBDBM191828(US9187428, 56)
Affinity DataEC50:  3.00E+3nMpH: 7.4 T: 2°C. Assay description: The following test protocol is used for pharmacologically characterizing cells and for the robot-assisted substance screening:The stock cultures ar...
In DepthDetails US Patent