BDBM19251 (2R)-2-hydroxy-3-[(4-isothiocyanatobenzene)sulfonyl]-2-methyl-N-[4-nitro-3-(trifluoromethyl)phenyl]propanamide::arylisothiocyanato derivative, R-36
SMILES C[C@](O)(CS(=O)(=O)c1ccc(cc1)N=C=S)C(=O)Nc1ccc(c(c1)C(F)(F)F)[N+]([O-])=O
InChI Key InChIKey=CEFRVXZOLNMWKD-KRWDZBQOSA-N
Data  1 KI
  Tab Delimited (TSV)   2D SDfile   Computed 3D by Vconf -m prep SDfile
Find this compound or compounds like it in BindingDB:
Activity Spreadsheet -- Enzyme Inhibition Constant Data from BindingDB
Found 1 hit for monomerid = 19251
TargetAndrogen receptor(Rattus norvegicus (Rat))
University Of Tennessee Health Science Center
LigandPNGBDBM19251((2R)-2-hydroxy-3-[(4-isothiocyanatobenzene)sulfony...)
Affinity DataKi:  14.4nM ΔG°:  -9.94kcal/molepH: 7.4 T: 2°C. Assay description: The Ki values were determined by the application of the Cheng-Prusoff equation: Ki = (IC50 x Kd)/(Kd+[L]) where [L] is the concentration of [3H]MIB (...
In DepthDetails ArticlePubMed