BDBM1929 4-Hydroxy-3-[1-[3-[[3-(1H-indol-1-yl)-1-oxopropyl]amino]phenyl]propyl]coumarin::Carboxamide-Containing Phenprocoumon deriv. X::N-{3-[1-(4-hydroxy-2-oxo-2H-chromen-3-yl)propyl]phenyl}-3-(1H-indol-1-yl)propanamide
SMILES CCC(c1cccc(NC(=O)CCn2ccc3ccccc23)c1)c1c(O)c2ccccc2oc1=O
InChI Key InChIKey=XDJLFZFYOMGKLQ-UHFFFAOYSA-N
Data  1 KI
  Tab Delimited (TSV)   2D SDfile   Computed 3D by Vconf -m prep SDfile
Find this compound or compounds like it in BindingDB:
Activity Spreadsheet -- Enzyme Inhibition Constant Data from BindingDB
Found 1 hit for monomerid = 1929
TargetDimer of Gag-Pol polyprotein [489-587](Human immunodeficiency virus type 1)
Upjohn
LigandPNGBDBM1929(4-Hydroxy-3-[1-[3-[[3-(1H-indol-1-yl)-1-oxopropyl]...)
Affinity DataKi:  110nM ΔG°:  -9.39kcal/molepH: 5.0 T: 2°C. Assay description: HIV-1 protease was purified and refolded from E. coli inclusion bodies. The substrate used spans the p17-p24 processing site (R-V-S-Q-N-Y-P-I-V-Q-N-K...
Ligand InfoPC cidPC sid
In DepthDetails ArticlePubMed