BDBM193391 US9670208, Example 113
SMILES CN1CC(CC(C1)c1nnc2cc(ccn12)-c1ccnc(Nc2ccnn2C)n1)Oc1c(F)cccc1F
InChI Key InChIKey=JVKFYJQOZIVFAD-UHFFFAOYSA-N
Data  1 IC50
  Tab Delimited (TSV)   2D SDfile   Computed 3D by Vconf -m prep SDfile
Find this compound or compounds like it in BindingDB:
Activity Spreadsheet -- Enzyme Inhibition Constant Data from BindingDB
Found 1 hit for monomerid = 193391
TargetMitogen-activated protein kinase 1 [8-360](Homo sapiens (Human))
Array Biopharma
US Patent
LigandPNGBDBM193391(US9670208, Example 113)
Affinity DataIC50:  3.40nMpH: 7.3Assay Description:Compounds were tested in an enzymatic assay using human ERK-2 (Mitogen Activated Kinase 1), recombinantly expressed as an n-terminal 6-His fusion pro...
Ligand InfoPC cidPC sid
In DepthDetails US Patent