BDBM193400 US9670208, Example 132 4-(3-(1-((5-fluoro-2-methoxypyridin-3-yl)methyl)piperidin-3-yl)-[1,2,4]triazolo[4,3-a]pyridin-7-yl)-N-(tetrahydro-2H-pyran-4-yl)pyrimidin-2-amine
SMILES COc1ncc(F)cc1CN1CCCC(C1)c1nnc2cc(ccn12)-c1ccnc(NC2CCOCC2)n1
InChI Key InChIKey=YGGHWFFCNNGXKD-UHFFFAOYSA-N
Data  1 IC50
  Tab Delimited (TSV)   2D SDfile   Computed 3D by Vconf -m prep SDfile
Find this compound or compounds like it in BindingDB:
Activity Spreadsheet -- Enzyme Inhibition Constant Data from BindingDB
Found 1 hit for monomerid = 193400
TargetMitogen-activated protein kinase 1 [8-360](Homo sapiens (Human))
Array Biopharma
US Patent
LigandPNGBDBM193400(US9670208, Example 132 4-(3-(1-((5-fluoro-2-methox...)
Affinity DataIC50:  197nMpH: 7.3Assay Description:Compounds were tested in an enzymatic assay using human ERK-2 (Mitogen Activated Kinase 1), recombinantly expressed as an n-terminal 6-His fusion pro...
Ligand InfoPC cidPC sid
In DepthDetails US Patent