BDBM193858 (E)-3-(2-(2-(1-(4-hydroxy-3-methoxyphenyl)ethylidene)hydrazinyl)thiazol-4-yl)-2H-chromen-2-one (6k)
SMILES COc1cc(ccc1O)C(\C)=N\Nc1nc(cs1)-c1cc2ccccc2oc1=O
InChI Key InChIKey=URWHTEGPPNEBIV-FSJBWODESA-N
Data  2 IC50
  Tab Delimited (TSV)   2D SDfile   Computed 3D by Vconf -m prep SDfile
Find this compound or compounds like it in BindingDB:
Activity Spreadsheet -- Enzyme Inhibition Constant Data from BindingDB
Found 2 hits for monomerid = 193858
TargetAldo-keto reductase family 1 member B1 [K65Q](Bos taurus (Cattle))
Comsats Institute Of Information Technology
LigandPNGBDBM193858((E)-3-(2-(2-(1-(4-hydroxy-3-methoxyphenyl)ethylide...)
Affinity DataIC50:  1.76E+3nM. Assay description: The activity of ALR2 enzyme was determined at 340 nm in UV spectrophotometer that depends upon the measurement of NADPH consumption. Each well of the...
In DepthDetails ArticlePubMed
TargetAldo-keto reductase family 1 member A1(Bos taurus (Cattle))
Comsats Institute Of Information Technology
LigandPNGBDBM193858((E)-3-(2-(2-(1-(4-hydroxy-3-methoxyphenyl)ethylide...)
Affinity DataIC50:  1.41E+3nMpH: 6.2Assay Description:The assay results were obtained at 340 nm and ALR1 inhibitory activity was measured with the absorbance change at this respective wavelength. Each we...
In DepthDetails ArticlePubMed