BDBM1940 Carboxamide-Containing 4-Hydroxy-2-pyrone analogue XXI::N-(3-{cyclopropyl[4-hydroxy-2-oxo-6-(1-phenylbutan-2-yl)-2H-pyran-3-yl]methyl}phenyl)-2-(pyridin-4-yl)acetamide::N-[3-[Cyclopropyl[4-hydroxy-2-oxo-6-[1-(phenylmethyl)propyl]-2H-pyran-3-yl]methyl]phenyl]-(4-pyridyl)acetamide
SMILES CCC(Cc1ccccc1)c1cc(O)c(C(C2CC2)c2cccc(NC(=O)Cc3ccncc3)c2)c(=O)o1
InChI Key InChIKey=RTXCQPDBXIDIQX-UHFFFAOYSA-N
Data  1 KI
  Tab Delimited (TSV)   2D SDfile   Computed 3D by Vconf -m prep SDfile
Find this compound or compounds like it in BindingDB:
Activity Spreadsheet -- Enzyme Inhibition Constant Data from BindingDB
Found 1 hit for monomerid = 1940
TargetDimer of Gag-Pol polyprotein [489-587](Human immunodeficiency virus type 1)
Upjohn
LigandPNGBDBM1940(Carboxamide-Containing 4-Hydroxy-2-pyrone analogue...)
Affinity DataKi:  44nM ΔG°:  -9.93kcal/molepH: 5.0 T: 2°C. Assay description: HIV-1 protease was purified and refolded from E. coli inclusion bodies. The substrate used spans the p17-p24 processing site (R-V-S-Q-N-Y-P-I-V-Q-N-K...
Ligand InfoPC cidPC sid
In DepthDetails ArticlePubMed