BDBM19533 (2S)-N-(cyanomethyl)-4-methyl-2-{[(1S)-2,2,2-trifluoro-1-[4-(4-sulfamoylphenyl)phenyl]ethyl]amino}pentanamide::trifluoroethylamine analogue, 23
SMILES CC(C)C[C@H](N[C@@H](c1ccc(cc1)-c1ccc(cc1)S(N)(=O)=O)C(F)(F)F)C(=O)NCC#N
InChI Key InChIKey=SVLOPEXSNUUHTH-PMACEKPBSA-N
Data  4 IC50
  Tab Delimited (TSV)   2D SDfile   Computed 3D by Vconf -m prep SDfile
Find this compound or compounds like it in BindingDB:
Activity Spreadsheet -- Enzyme Inhibition Constant Data from BindingDB
Found 4 hits for monomerid = 19533
TargetCathepsin S(Homo sapiens (Human))
Merck Frosst Centre For Therapeutic Research
LigandPNGBDBM19533((2S)-N-(cyanomethyl)-4-methyl-2-{[(1S)-2,2,2-trifl...)
Affinity DataIC50:  154nMpH: 6.5 T: 2°C. Assay description: Prior to the addition of substrate, different concentrations of the inhibitor ranging from 100 uM to 0.2 nM were preincubated for 15 min with enzyme ...
In DepthDetails ArticlePubMed
TargetProcathepsin L(Homo sapiens (Human))
Merck Frosst Centre For Therapeutic Research
LigandPNGBDBM19533((2S)-N-(cyanomethyl)-4-methyl-2-{[(1S)-2,2,2-trifl...)
Affinity DataIC50:  470nM. Assay description: Prior to the addition of substrate, different concentrations of the inhibitor ranging from 100 uM to 0.2 nM were preincubated for 15 min with enzyme ...
In DepthDetails ArticlePubMed
TargetCathepsin K(Oryctolagus cuniculus (rabbit))
Merck Frosst Centre For Therapeutic Research
LigandPNGBDBM19533((2S)-N-(cyanomethyl)-4-methyl-2-{[(1S)-2,2,2-trifl...)
Affinity DataIC50:  0.200nM. Assay description: Prior to the addition of substrate, different concentrations of the inhibitor ranging from 100 uM to 0.2 nM were preincubated for 15 min with enzyme ...
In DepthDetails ArticlePubMed
TargetCathepsin B(Homo sapiens (Human))
Merck Frosst Centre For Therapeutic Research
LigandPNGBDBM19533((2S)-N-(cyanomethyl)-4-methyl-2-{[(1S)-2,2,2-trifl...)
Affinity DataIC50:  1.56E+3nM. Assay description: Prior to the addition of substrate, different concentrations of the inhibitor ranging from 100 uM to 0.2 nM were preincubated for 15 min with enzyme ...
In DepthDetails ArticlePubMed