BDBM195594 US9216974, WC-5-45
SMILES COc1ccc(OCCOc2ccc3nc4ccc(=O)cc4oc3c2)cc1
InChI Key InChIKey=GJSIPFPHFHPBSW-UHFFFAOYSA-N
Data  1 KI
  Tab Delimited (TSV)   2D SDfile   Computed 3D by Vconf -m prep SDfile
Find this compound or compounds like it in BindingDB:
Activity Spreadsheet -- Enzyme Inhibition Constant Data from BindingDB
Found 1 hit for monomerid = 195594
TargetAmyloid-beta precursor protein(Homo sapiens (Human))
Washington University
US Patent
LigandPNGBDBM195594(US9216974, WC-5-45)
Affinity DataKi:  421nM. Assay description: To determine the Ki values, fixed brain tissues prepared from 15-month-old Tg2576 mice (N=5) will be incubated for 30 min with 1 μM methoxy-X34 ...
Ligand InfoPC cidPC sid
In DepthDetails US Patent