BDBM19684 (2S)-1-(morpholin-4-yl)-1-oxo-3-phenylpropan-2-yl N-[(2S)-1-{[4-(trifluoromethoxy)phenyl]amino}propan-2-yl]carbamate::Arylaminoethyl carbamate, 15
SMILES C[C@@H](CNc1ccc(OC(F)(F)F)cc1)NC(=O)O[C@@H](Cc1ccccc1)C(=O)N1CCOCC1
InChI Key InChIKey=SOIPFVFRBJCCLH-UWJYYQICSA-N
Data  3 KI
  Tab Delimited (TSV)   2D SDfile   Computed 3D by Vconf -m prep SDfile
Find this compound or compounds like it in BindingDB:
Activity Spreadsheet -- Enzyme Inhibition Constant Data from BindingDB
Found 3 hits for monomerid = 19684
TargetCathepsin S(Homo sapiens (Human))
Gnf
LigandPNGBDBM19684((2S)-1-(morpholin-4-yl)-1-oxo-3-phenylpropan-2-yl ...)
Affinity DataKi:  1.26E+4nM ΔG°:  -6.95kcal/molepH: 5.5 T: 2°C. Assay description: The recombinant human cathepsin enzyme was preincubated with inhibitor for 20 minutes prior to addition of substrate. The substrate hydrolysis was mo...
Ligand InfoPC cidPC sid
In DepthDetails ArticlePubMed
TargetProcathepsin L(Homo sapiens (Human))
Gnf
LigandPNGBDBM19684((2S)-1-(morpholin-4-yl)-1-oxo-3-phenylpropan-2-yl ...)
Affinity DataKi: >1.00E+5nM. Assay description: The recombinant human cathepsin enzyme was preincubated with inhibitor for 20 minutes prior to addition of substrate. The substrate hydrolysis was mo...
Ligand InfoPC cidPC sid
In DepthDetails ArticlePubMed
TargetCathepsin K(Homo sapiens (Human))
Gnf
LigandPNGBDBM19684((2S)-1-(morpholin-4-yl)-1-oxo-3-phenylpropan-2-yl ...)
Affinity DataKi: >1.00E+5nM. Assay description: The recombinant human cathepsin enzyme was preincubated with inhibitor for 20 minutes prior to addition of substrate. The substrate hydrolysis was mo...
Ligand InfoPC cidPC sid
In DepthDetails ArticlePubMed