BDBM19689 (2S)-3-cyclohexyl-1-(morpholin-4-yl)-1-oxopropan-2-yl N-[(2S)-1-{5'-fluoro-1',2'-dihydrospiro[cyclopropane-1,3'-indole]}propan-2-yl]carbamate::Arylaminoethyl carbamate, 20
SMILES C[C@@H](CN1CC2(CC2)c2cc(F)ccc12)NC(=O)O[C@@H](CC1CCCCC1)C(=O)N1CCOCC1
InChI Key InChIKey=STUFXVTWLOTSDC-CYFREDJKSA-N
Data  3 KI
  Tab Delimited (TSV)   2D SDfile   Computed 3D by Vconf -m prep SDfile
Find this compound or compounds like it in BindingDB:
Activity Spreadsheet -- Enzyme Inhibition Constant Data from BindingDB
Found 3 hits for monomerid = 19689
TargetCathepsin S(Homo sapiens (Human))
Gnf
LigandPNGBDBM19689((2S)-3-cyclohexyl-1-(morpholin-4-yl)-1-oxopropan-2...)
Affinity DataKi:  122nM ΔG°:  -9.80kcal/molepH: 5.5 T: 2°C. Assay description: The recombinant human cathepsin enzyme was preincubated with inhibitor for 20 minutes prior to addition of substrate. The substrate hydrolysis was mo...
In DepthDetails ArticlePubMed
TargetProcathepsin L(Homo sapiens (Human))
Gnf
LigandPNGBDBM19689((2S)-3-cyclohexyl-1-(morpholin-4-yl)-1-oxopropan-2...)
Affinity DataKi: >3.00E+4nM. Assay description: The recombinant human cathepsin enzyme was preincubated with inhibitor for 20 minutes prior to addition of substrate. The substrate hydrolysis was mo...
In DepthDetails ArticlePubMed
TargetCathepsin K(Homo sapiens (Human))
Gnf
LigandPNGBDBM19689((2S)-3-cyclohexyl-1-(morpholin-4-yl)-1-oxopropan-2...)
Affinity DataKi: >3.00E+4nM. Assay description: The recombinant human cathepsin enzyme was preincubated with inhibitor for 20 minutes prior to addition of substrate. The substrate hydrolysis was mo...
In DepthDetails ArticlePubMed