BDBM197159 3-((2-chlorophenyl)thio)-4-hydroxy-6-phenyl-6-(thiophen-3-yl)-5,6-dihydropyridin-2(1H)-one (5)
SMILES OC1=C(Sc2ccccc2Cl)C(=O)NC(C1)(c1ccsc1)c1ccccc1
InChI Key InChIKey=LPEYRTGVFRLICD-UHFFFAOYSA-N
Data  2 IC50
  Tab Delimited (TSV)   2D SDfile   Computed 3D by Vconf -m prep SDfile
Find this compound or compounds like it in BindingDB:
Activity Spreadsheet -- Enzyme Inhibition Constant Data from BindingDB
Found 2 hits for monomerid = 197159
TargetL-lactate dehydrogenase B chain(Homo sapiens (Human))
Genentech
LigandPNGBDBM197159(3-((2-chlorophenyl)thio)-4-hydroxy-6-phenyl-6-(thi...)
Affinity DataIC50:  740nM. Assay description: LDHA, LDHB, LDHC, MDH1 and MDH2 enzymatic assays have been described in detail previously [Dragovich, P.S. et al, Bioorg. Med. Chem. Lett. 24:3764-37...
Ligand InfoPC cidPC sid
In DepthDetails ArticlePubMed
TargetL-lactate dehydrogenase A chain(Homo sapiens (Human))
Genentech
LigandPNGBDBM197159(3-((2-chlorophenyl)thio)-4-hydroxy-6-phenyl-6-(thi...)
Affinity DataIC50:  120nM. Assay description: LDHA, LDHB, LDHC, MDH1 and MDH2 enzymatic assays have been described in detail previously [Dragovich, P.S. et al, Bioorg. Med. Chem. Lett. 24:3764-37...
Ligand InfoPC cidPC sid
In DepthDetails ArticlePubMed