BDBM197303 4-Methylbenzoic acid::SAMPL4, O2
SMILES Cc1ccc(cc1)C(O)=O
InChI Key InChIKey=LPNBBFKOUUSUDB-UHFFFAOYSA-N
Data  2 KI  1 IC50  1 ITC
PDB links: 4 PDB IDs match this monomer.
  Tab Delimited (TSV)   2D SDfile   Computed 3D by Vconf -m prep SDfile
Find this compound or compounds like it in BindingDB:
Activity Spreadsheet -- Enzyme Inhibition Constant Data from BindingDB
Found 3 hits for monomerid = 197303
TargetSigma non-opioid intracellular receptor 1(Cavia porcellus (Guinea pig))
University Of Catania
Curated by ChEMBL
LigandPNGBDBM197303(4-Methylbenzoic acid | SAMPL4, O2)
Affinity DataKi: >1.00E+4nM. Assay description: Displacement of [3H]-(+)-pentazocine from sigma1 receptor in guinea pig brain membranes incubated for 1 hr by liquid scintillation counting method
In DepthDetails ArticlePubMed
TargetSigma intracellular receptor 2(Homo sapiens (Human))
University Of Catania
Curated by ChEMBL
LigandPNGBDBM197303(4-Methylbenzoic acid | SAMPL4, O2)
Affinity DataKi: >1.00E+4nM. Assay description: Displacement of [3H]-di-o-tolylguanidine from sigma2 receptor (unknown origin) incubated for 1 hr in presence of (+)SKF10047 by liquid scintillation ...
In DepthDetails ArticlePubMed
TargetUrease subunit alpha(Helicobacter pylori ATCC43504)
Wuhan Textile University
LigandPNGBDBM197303(4-Methylbenzoic acid | SAMPL4, O2)
Affinity DataIC50: >1.00E+5nMpH: 7.4 T: 2°C. Assay description: Briefly, 50 mL broth cultures (2.0 × 10^8 CFU/mL) were centrifuged (5000g, 4°C)to collect the bacteria, and after washing twice with phosph...
In DepthDetails ArticlePubMed
Activity Spreadsheet -- ITC Data from BindingDB
Found 1 hit for monomerid = 197303
HostPNGBDBM197287(SAMPL4, OA)
University Of California San Diego
GuestPNGBDBM197303(4-Methylbenzoic acid | SAMPL4, O2)
ITC DataΔG°: -5.97kcal/mole logk: 2.00E+4
pH: 9.2 T: 24.85°C
Cell InfoPC cidPC sid