BDBM199221 US9216998, 3
SMILES FC(F)(F)c1c(Cc2ccccc2)n2CCCc3cccc1c23
InChI Key InChIKey=FAGOQRFFMJSNPJ-UHFFFAOYSA-N
Data  2 IC50
  Tab Delimited (TSV)   2D SDfile   Computed 3D by Vconf -m prep SDfile
Find this compound or compounds like it in BindingDB:
Activity Spreadsheet -- Enzyme Inhibition Constant Data from BindingDB
Found 2 hits for monomerid = 199221
TargetEndothelial lipase(Mus musculus (Mouse))
Janssen Pharmaceutica
US Patent
LigandPNGBDBM199221(US9216998, 3)
Affinity DataIC50:  96nMpH: 7.2Assay Description:To assay for cell surface lipase activity, cells expressing human endothelial lipase (EL) or LPL were plated in CellBIND® 384-well plates (Corning, L...
Ligand InfoPC cidPC sid
In DepthDetails US Patent
TargetEndothelial lipase(Homo sapiens (Human))
Janssen Pharmaceutica
US Patent
LigandPNGBDBM199221(US9216998, 3)
Affinity DataIC50:  115nMpH: 7.2Assay Description:To assay for cell surface lipase activity, cells expressing human endothelial lipase (EL) or LPL were plated in CellBIND® 384-well plates (Corning, L...
Ligand InfoPC cidPC sid
In DepthDetails US Patent