BDBM199494 US9226922, 49
SMILES COC[C@@H](NC(=O)Nc1cc2[nH]nc(OC)c2c(n1)C(C)C)c1ccccc1
InChI Key
Data  1 IC50
  Tab Delimited (TSV)   2D SDfile   Computed 3D by Vconf -m prep SDfile
Find this compound or compounds like it in BindingDB:
Activity Spreadsheet -- Enzyme Inhibition Constant Data from BindingDB
Found 1 hit for monomerid = 199494
TargetMitogen-activated protein kinase 1(Homo sapiens (Human))
Merck Sharp & Dohme
US Patent
LigandPNGBDBM199494(US9226922, 49)
Affinity DataIC50:  65.8nM. Assay description: Activated ERK2 activity was determined in an IMAP-FP assay (Molecular Devices). Using this assay format, the potency (IC50) of each compound was dete...
Ligand InfoPC cidPC sid
In DepthDetails US Patent