BDBM20050 5-chloro-6-[4-(2-hydroxyethyl)piperidin-1-yl]-1,3-diazinane-2,4-dione::uracil, 20
SMILES OCCC1CCN(CC1)c1[nH]c(=O)[nH]c(=O)c1Cl
InChI Key InChIKey=RWWZYORFHGIOOC-UHFFFAOYSA-N
Data  2 IC50
  Tab Delimited (TSV)   2D SDfile   Computed 3D by Vconf -m prep SDfile
Find this compound or compounds like it in BindingDB:
Activity Spreadsheet -- Enzyme Inhibition Constant Data from BindingDB
Found 2 hits for monomerid = 20050
TargetThymidine phosphorylase(Escherichia coli)
Academy Of Sciences Of The Czech Republic
LigandPNGBDBM20050(5-chloro-6-[4-(2-hydroxyethyl)piperidin-1-yl]-1,3-...)
Affinity DataIC50:  5.50E+3nM. Assay description: The enzyme reaction was started by the addition of enzyme to the reaction mixture containing substrate and test compounds. The reaction was stopped b...
In DepthDetails ArticlePubMed
TargetThymidine phosphorylase(Homo sapiens (Human))
Academy Of Sciences Of The Czech Republic
LigandPNGBDBM20050(5-chloro-6-[4-(2-hydroxyethyl)piperidin-1-yl]-1,3-...)
Affinity DataIC50:  7.50E+3nMpH: 6.4 T: 2°C. Assay description: The enzyme reaction was started by the addition of enzyme to the reaction mixture containing substrate and test compounds. The reaction was stopped b...
In DepthDetails ArticlePubMed