BDBM201166 US9233953, 128
SMILES Clc1cccc(c1)N1CCN(C(C1)c1cccs1)C(=O)C1CCS(=O)(=O)CC1
InChI Key InChIKey=ZDOYJTFSQDZROR-UHFFFAOYSA-N
Data  1 IC50
  Tab Delimited (TSV)   2D SDfile   Computed 3D by Vconf -m prep SDfile
Find this compound or compounds like it in BindingDB:
Activity Spreadsheet -- Enzyme Inhibition Constant Data from BindingDB
Found 1 hit for monomerid = 201166
TargetSodium- and chloride-dependent glycine transporter 1(Homo sapiens (Human))
Boehringer Ingelheim International
US Patent
LigandPNGBDBM201166(US9233953, 128)
Affinity DataIC50:  17nM. Assay description: Cells expressing either endogenously the GlyT1 transporter like JAR cells (human placental choriocarcinoma cells; e.g. WO 2008/002583) or SK-N-MC cel...
Ligand InfoPC cidPC sid
In DepthDetails US Patent