BDBM201322 US9187424, 86
SMILES Cc1ccc(cc1)C1=C(C(=O)Nc2ccc(cc2)C(F)(F)F)C(=O)NC(C1)(c1ccc(OCCCC(F)(F)F)cc1)C(F)(F)F
InChI Key InChIKey=YRBZGMMXPRVOGF-UHFFFAOYSA-N
Data  2 IC50
  Tab Delimited (TSV)   2D SDfile   Computed 3D by Vconf -m prep SDfile
Find this compound or compounds like it in BindingDB:
Activity Spreadsheet -- Enzyme Inhibition Constant Data from BindingDB
Found 2 hits for monomerid = 201322
TargetAlpha-1,6-mannosyl-glycoprotein 2-beta-N-acetylglucosaminyltransferase(Homo sapiens (Human))
Bristol-Myers Squibb
US Patent
LigandPNGBDBM201322(US9187424, 86)
Affinity DataIC50:  201nMpH: 7.4 T: 2°C. Assay description: MGAT2 enzyme was assayed using membranes isolated from Sf9 cells expressing the recombinant human MGAT2 cDNA with 2-monooleoylglycerol and [3H]-oleoy...
Ligand InfoPC cidPC sid
In DepthDetails US Patent
TargetAlpha-1,6-mannosyl-glycoprotein 2-beta-N-acetylglucosaminyltransferase(Homo sapiens (Human))
Bristol-Myers Squibb
US Patent
LigandPNGBDBM201322(US9187424, 86)
Affinity DataIC50:  1nMpH: 7.4Assay Description:The MGAT enzyme reactions were performed in CORNING Falcon 96-well Polypropylene plates, in a total volume of 60 uL of 50 mM Potassium Phosphate buff...
Ligand InfoPC cidPC sid
In DepthDetails US Patent