BDBM202274 US9238619, 32
SMILES CN(C)CC(Cc1ccccc1)c1ccc(F)c(OCCNS(=O)(=O)c2cn(C)cn2)c1
InChI Key InChIKey=AKTCMKHHANHAPV-UHFFFAOYSA-N
Data  1 KI
  Tab Delimited (TSV)   2D SDfile   Computed 3D by Vconf -m prep SDfile
Find this compound or compounds like it in BindingDB:
Activity Spreadsheet -- Enzyme Inhibition Constant Data from BindingDB
Found 1 hit for monomerid = 202274
TargetSodium- and chloride-dependent glycine transporter 1(Homo sapiens (Human))
Abbvie Deutschland
US Patent
LigandPNGBDBM202274(US9238619, 32)
Affinity DataKi: <0.100nM. Assay description: Radioligand binding to human GlyT1c transporter-expressing membranes was determined as described in Mezler et al., Molecular Pharmacology 74:1705-171...
Ligand InfoPC cidPC sid
In DepthDetails US Patent