BDBM202487 US9539260, A1::US9763952, Example A1
SMILES COc1ncc(cc1C)N1CCOc2ccc(O[C@H]3CCN(C3)C(=O)C3CCOCC3)cc12
InChI Key InChIKey=PANKPFHBSGGOEF-NRFANRHFSA-N
Data  4 IC50
  Tab Delimited (TSV)   2D SDfile   Computed 3D by Vconf -m prep SDfile
Find this compound or compounds like it in BindingDB:
Activity Spreadsheet -- Enzyme Inhibition Constant Data from BindingDB
Found 4 hits for monomerid = 202487
LigandPNGBDBM202487(US9539260, A1 | US9763952, Example A1)
Affinity DataIC50:  322nMT: 2°C. Assay description: Determination of Enzymatic PI3K Alpha and PI3K Delta Isoform Inhibition1.1 Test of Lipid Kinase ActivityThe efficacy of the compounds of examples 1-1...
Ligand InfoPC cidPC sid
In DepthDetails US Patent
LigandPNGBDBM202487(US9539260, A1 | US9763952, Example A1)
Affinity DataIC50:  6nM
Ligand InfoPC cidPC sid
In DepthDetails US Patent
LigandPNGBDBM202487(US9539260, A1 | US9763952, Example A1)
Affinity DataIC50:  322nM. Assay description: The kinase reaction is performed in a final volume of 50 μl per well of a half area COSTAR, 96 well plate. The final concentrations of ATP and p...
Ligand InfoPC cidPC sid
In DepthDetails US Patent
LigandPNGBDBM202487(US9539260, A1 | US9763952, Example A1)
Affinity DataIC50:  6nMT: 2°C. Assay description: Determination of Enzymatic PI3K Alpha and PI3K Delta Isoform Inhibition1.1 Test of Lipid Kinase ActivityThe efficacy of the compounds of examples 1-1...
Ligand InfoPC cidPC sid
In DepthDetails US Patent