BDBM202791 US10245267, Example 138::US10709712, Example 138::US9242969, 138::US9694016, 138
SMILES Cc1ncc(NC(=O)c2cccc(c2)C(F)(F)F)cc1-c1cc(N2CCOCC2)c(=O)n(C)c1
InChI Key InChIKey=NLRKKGQQNSZMJI-UHFFFAOYSA-N
Data  14 IC50  1 EC50
  Tab Delimited (TSV)   2D SDfile   Computed 3D by Vconf -m prep SDfile
Find this compound or compounds like it in BindingDB:
Activity Spreadsheet -- Enzyme Inhibition Constant Data from BindingDB
Found 15 hits for monomerid = 202791
TargetSerine/threonine-protein kinase B-raf(Homo sapiens (Human))
Novartis
US Patent
LigandPNGBDBM202791(US10245267, Example 138 | US10709712, Example 138 ...)
Affinity DataIC50:  3.11nMpH: 7.5 T: 2°C. Assay description: Final assay conditions were 4 pM cRaf, 3 uM ATP, 10 nM biotin tagged MEK1 kinase dead protein substrate. Reactions were performed in Greiner384 well ...
Ligand InfoPC cidPC sid
In DepthDetails US Patent
TargetRAF proto-oncogene serine/threonine-protein kinase(Homo sapiens (Human))
Novartis
US Patent
LigandPNGBDBM202791(US10245267, Example 138 | US10709712, Example 138 ...)
Affinity DataIC50:  0.800nM. Assay description: C-Raf TR refers to a truncated C-Raf protein, a Δ1-324 deletion mutant.C-Raf FL refers to the full-length C-Raf protein.Full length MEK1 with an...
Ligand InfoPC cidPC sid
In DepthDetails US Patent
TargetSerine/threonine-protein kinase B-raf [V600E](Homo sapiens (Human))
Novartis
US Patent
LigandPNGBDBM202791(US10245267, Example 138 | US10709712, Example 138 ...)
Affinity DataIC50:  4.70nMpH: 7.5 T: 2°C. Assay description: Raf and biotinylated Mek, kinase dead, were combined at 2x final concentrations in assay buffer (50 mM Tris, pH 7.5, 15 mM MgCl2, 0.01% BSA and 1 mM ...
Ligand InfoPC cidPC sid
In DepthDetails US Patent
TargetRAF proto-oncogene serine/threonine-protein kinase [Y340E,Y341E](Homo sapiens (Human))
Novartis
US Patent
LigandPNGBDBM202791(US10245267, Example 138 | US10709712, Example 138 ...)
Affinity DataIC50:  0.800nMpH: 7.5 T: 2°C. Assay description: Raf and biotinylated Mek, kinase dead, were combined at 2x final concentrations in assay buffer (50 mM Tris, pH 7.5, 15 mM MgCl2, 0.01% BSA and 1 mM ...
Ligand InfoPC cidPC sid
In DepthDetails US Patent
TargetSerine/threonine-protein kinase B-raf [V600E](Homo sapiens (Human))
Novartis
US Patent
LigandPNGBDBM202791(US10245267, Example 138 | US10709712, Example 138 ...)
Affinity DataIC50:  3.11nMpH: 7.5 T: 2°C. Assay description: Raf and biotinylated Mek, kinase dead, were combined at 2x final concentrations in assay buffer (50 mM Tris, pH 7.5, 15 mM MgCl2, 0.01% BSA and 1 mM ...
Ligand InfoPC cidPC sid
In DepthDetails US Patent
TargetRAF proto-oncogene serine/threonine-protein kinase [Y340E,Y341E](Homo sapiens (Human))
Novartis
US Patent
LigandPNGBDBM202791(US10245267, Example 138 | US10709712, Example 138 ...)
Affinity DataIC50:  0.650nMpH: 7.5 T: 2°C. Assay description: Raf and biotinylated Mek, kinase dead, were combined at 2x final concentrations in assay buffer (50 mM Tris, pH 7.5, 15 mM MgCl2, 0.01% BSA and 1 mM ...
Ligand InfoPC cidPC sid
In DepthDetails US Patent
TargetRAF proto-oncogene serine/threonine-protein kinase(Homo sapiens (Human))
Novartis
US Patent
LigandPNGBDBM202791(US10245267, Example 138 | US10709712, Example 138 ...)
Affinity DataEC50:  460nM. Assay description: Inhibition CRAF in human Calu6 cells assessed as decrease in MEK phosphorylation after 2 hrs by HTRF method
Ligand InfoPC cidPC sid
In DepthDetails ArticlePubMed
TargetSerine/threonine-protein kinase B-raf [V600E](Homo sapiens (Human))
Novartis
US Patent
LigandPNGBDBM202791(US10245267, Example 138 | US10709712, Example 138 ...)
Affinity DataIC50:  3.11nM. Assay description: Raf and biotinylated Mek, kinase dead, were combined at 2× final concentrations in assay buffer (50 mM Tris, pH 7.5, 15 mM MgCl2, 0.01% BSA and 1 mM ...
Ligand InfoPC cidPC sid
In DepthDetails US Patent
TargetRAF proto-oncogene serine/threonine-protein kinase(Homo sapiens (Human))
Novartis
US Patent
LigandPNGBDBM202791(US10245267, Example 138 | US10709712, Example 138 ...)
Affinity DataIC50:  0.652nM. Assay description: Raf and biotinylated Mek, kinase dead, were combined at 2× final concentrations in assay buffer (50 mM Tris, pH 7.5, 15 mM MgCl2, 0.01% BSA and 1 mM ...
Ligand InfoPC cidPC sid
In DepthDetails US Patent
TargetSerine/threonine-protein kinase B-raf [V600E](Homo sapiens (Human))
Novartis
US Patent
LigandPNGBDBM202791(US10245267, Example 138 | US10709712, Example 138 ...)
Affinity DataIC50:  4.70nM. Assay description: Raf and biotinylated Mek, kinase dead, were combined at 2× final concentrations in assay buffer (50 mM Tris, pH 7.5, 15 mM MgCl2, 0.01% BSA and 1 mM ...
Ligand InfoPC cidPC sid
In DepthDetails US Patent
TargetRAF proto-oncogene serine/threonine-protein kinase(Homo sapiens (Human))
Novartis
US Patent
LigandPNGBDBM202791(US10245267, Example 138 | US10709712, Example 138 ...)
Affinity DataIC50:  0.800nM. Assay description: Raf and biotinylated Mek, kinase dead, were combined at 2× final concentrations in assay buffer (50 mM Tris, pH 7.5, 15 mM MgCl2, 0.01% BSA and 1 mM ...
Ligand InfoPC cidPC sid
In DepthDetails US Patent
TargetSerine/threonine-protein kinase B-raf [V600E](Homo sapiens (Human))
Novartis
US Patent
LigandPNGBDBM202791(US10245267, Example 138 | US10709712, Example 138 ...)
Affinity DataIC50:  3.11nM. Assay description: C-Raf TR refers to a truncated C-Raf protein, a Δ1-324 deletion mutant.C-Raf FL refers to the full-length C-Raf protein.Full length MEK1 with an...
Ligand InfoPC cidPC sid
In DepthDetails US Patent
TargetRAF proto-oncogene serine/threonine-protein kinase(Homo sapiens (Human))
Novartis
US Patent
LigandPNGBDBM202791(US10245267, Example 138 | US10709712, Example 138 ...)
Affinity DataIC50:  0.652nM. Assay description: C-Raf TR refers to a truncated C-Raf protein, a Δ1-324 deletion mutant.C-Raf FL refers to the full-length C-Raf protein.Full length MEK1 with an...
Ligand InfoPC cidPC sid
In DepthDetails US Patent
TargetSerine/threonine-protein kinase B-raf [V600E](Homo sapiens (Human))
Novartis
US Patent
LigandPNGBDBM202791(US10245267, Example 138 | US10709712, Example 138 ...)
Affinity DataIC50:  4.70nM. Assay description: C-Raf TR refers to a truncated C-Raf protein, a Δ1-324 deletion mutant.C-Raf FL refers to the full-length C-Raf protein.Full length MEK1 with an...
Ligand InfoPC cidPC sid
In DepthDetails US Patent
TargetRAF proto-oncogene serine/threonine-protein kinase [Y340E,Y341E](Homo sapiens (Human))
Novartis
US Patent
LigandPNGBDBM202791(US10245267, Example 138 | US10709712, Example 138 ...)
Affinity DataIC50:  0.652nMpH: 7.5 T: 2°C. Assay description: Final assay conditions were 4 pM cRaf, 3 uM ATP, 10 nM biotin tagged MEK1 kinase dead protein substrate. Reactions were performed in Greiner384 well ...
Ligand InfoPC cidPC sid
In DepthDetails US Patent