BDBM202822 US10245267, Example 169::US10709712, Example 169::US9242969, 169::US9694016, 169
SMILES CCn1cc(nc(N2CCOCC2)c1=O)-c1cc(NC(=O)c2cccc(c2)C(F)(F)F)ccc1C
InChI Key InChIKey=XQNRCPXMLMNNPS-UHFFFAOYSA-N
Data  14 IC50
  Tab Delimited (TSV)   2D SDfile   Computed 3D by Vconf -m prep SDfile
Find this compound or compounds like it in BindingDB:
Activity Spreadsheet -- Enzyme Inhibition Constant Data from BindingDB
Found 14 hits for monomerid = 202822
TargetSerine/threonine-protein kinase B-raf(Homo sapiens (Human))
Novartis
US Patent
LigandPNGBDBM202822(US10245267, Example 169 | US10709712, Example 169 ...)
Affinity DataIC50:  0.775nMpH: 7.5 T: 2°C. Assay description: Final assay conditions were 4 pM cRaf, 3 uM ATP, 10 nM biotin tagged MEK1 kinase dead protein substrate. Reactions were performed in Greiner384 well ...
Ligand InfoPC cidPC sid
In DepthDetails US Patent
TargetRAF proto-oncogene serine/threonine-protein kinase [Y340E,Y341E](Homo sapiens (Human))
Novartis
US Patent
LigandPNGBDBM202822(US10245267, Example 169 | US10709712, Example 169 ...)
Affinity DataIC50:  0.180nMpH: 7.5 T: 2°C. Assay description: Final assay conditions were 4 pM cRaf, 3 uM ATP, 10 nM biotin tagged MEK1 kinase dead protein substrate. Reactions were performed in Greiner384 well ...
Ligand InfoPC cidPC sid
In DepthDetails US Patent
TargetSerine/threonine-protein kinase B-raf [V600E](Homo sapiens (Human))
Novartis
US Patent
LigandPNGBDBM202822(US10245267, Example 169 | US10709712, Example 169 ...)
Affinity DataIC50:  0.800nMpH: 7.5 T: 2°C. Assay description: Raf and biotinylated Mek, kinase dead, were combined at 2x final concentrations in assay buffer (50 mM Tris, pH 7.5, 15 mM MgCl2, 0.01% BSA and 1 mM ...
Ligand InfoPC cidPC sid
In DepthDetails US Patent
TargetRAF proto-oncogene serine/threonine-protein kinase [Y340E,Y341E](Homo sapiens (Human))
Novartis
US Patent
LigandPNGBDBM202822(US10245267, Example 169 | US10709712, Example 169 ...)
Affinity DataIC50:  0.200nMpH: 7.5 T: 2°C. Assay description: Raf and biotinylated Mek, kinase dead, were combined at 2x final concentrations in assay buffer (50 mM Tris, pH 7.5, 15 mM MgCl2, 0.01% BSA and 1 mM ...
Ligand InfoPC cidPC sid
In DepthDetails US Patent
TargetSerine/threonine-protein kinase B-raf [V600E](Homo sapiens (Human))
Novartis
US Patent
LigandPNGBDBM202822(US10245267, Example 169 | US10709712, Example 169 ...)
Affinity DataIC50:  0.780nMpH: 7.5 T: 2°C. Assay description: Raf and biotinylated Mek, kinase dead, were combined at 2x final concentrations in assay buffer (50 mM Tris, pH 7.5, 15 mM MgCl2, 0.01% BSA and 1 mM ...
Ligand InfoPC cidPC sid
In DepthDetails US Patent
TargetRAF proto-oncogene serine/threonine-protein kinase [Y340E,Y341E](Homo sapiens (Human))
Novartis
US Patent
LigandPNGBDBM202822(US10245267, Example 169 | US10709712, Example 169 ...)
Affinity DataIC50:  0.180nMpH: 7.5 T: 2°C. Assay description: Raf and biotinylated Mek, kinase dead, were combined at 2x final concentrations in assay buffer (50 mM Tris, pH 7.5, 15 mM MgCl2, 0.01% BSA and 1 mM ...
Ligand InfoPC cidPC sid
In DepthDetails US Patent
TargetRAF proto-oncogene serine/threonine-protein kinase(Homo sapiens (Human))
Novartis
US Patent
LigandPNGBDBM202822(US10245267, Example 169 | US10709712, Example 169 ...)
Affinity DataIC50:  0.200nM. Assay description: C-Raf TR refers to a truncated C-Raf protein, a Δ1-324 deletion mutant.C-Raf FL refers to the full-length C-Raf protein.Full length MEK1 with an...
Ligand InfoPC cidPC sid
In DepthDetails US Patent
TargetRAF proto-oncogene serine/threonine-protein kinase(Homo sapiens (Human))
Novartis
US Patent
LigandPNGBDBM202822(US10245267, Example 169 | US10709712, Example 169 ...)
Affinity DataIC50:  0.180nM. Assay description: Raf and biotinylated Mek, kinase dead, were combined at 2× final concentrations in assay buffer (50 mM Tris, pH 7.5, 15 mM MgCl2, 0.01% BSA and 1 mM ...
Ligand InfoPC cidPC sid
In DepthDetails US Patent
TargetSerine/threonine-protein kinase B-raf [V600E](Homo sapiens (Human))
Novartis
US Patent
LigandPNGBDBM202822(US10245267, Example 169 | US10709712, Example 169 ...)
Affinity DataIC50:  0.800nM. Assay description: Raf and biotinylated Mek, kinase dead, were combined at 2× final concentrations in assay buffer (50 mM Tris, pH 7.5, 15 mM MgCl2, 0.01% BSA and 1 mM ...
Ligand InfoPC cidPC sid
In DepthDetails US Patent
TargetRAF proto-oncogene serine/threonine-protein kinase(Homo sapiens (Human))
Novartis
US Patent
LigandPNGBDBM202822(US10245267, Example 169 | US10709712, Example 169 ...)
Affinity DataIC50:  0.200nM. Assay description: Raf and biotinylated Mek, kinase dead, were combined at 2× final concentrations in assay buffer (50 mM Tris, pH 7.5, 15 mM MgCl2, 0.01% BSA and 1 mM ...
Ligand InfoPC cidPC sid
In DepthDetails US Patent
TargetSerine/threonine-protein kinase B-raf [V600E](Homo sapiens (Human))
Novartis
US Patent
LigandPNGBDBM202822(US10245267, Example 169 | US10709712, Example 169 ...)
Affinity DataIC50:  0.775nM. Assay description: C-Raf TR refers to a truncated C-Raf protein, a Δ1-324 deletion mutant.C-Raf FL refers to the full-length C-Raf protein.Full length MEK1 with an...
Ligand InfoPC cidPC sid
In DepthDetails US Patent
TargetRAF proto-oncogene serine/threonine-protein kinase(Homo sapiens (Human))
Novartis
US Patent
LigandPNGBDBM202822(US10245267, Example 169 | US10709712, Example 169 ...)
Affinity DataIC50:  0.180nM. Assay description: C-Raf TR refers to a truncated C-Raf protein, a Δ1-324 deletion mutant.C-Raf FL refers to the full-length C-Raf protein.Full length MEK1 with an...
Ligand InfoPC cidPC sid
In DepthDetails US Patent
TargetSerine/threonine-protein kinase B-raf [V600E](Homo sapiens (Human))
Novartis
US Patent
LigandPNGBDBM202822(US10245267, Example 169 | US10709712, Example 169 ...)
Affinity DataIC50:  0.800nM. Assay description: C-Raf TR refers to a truncated C-Raf protein, a Δ1-324 deletion mutant.C-Raf FL refers to the full-length C-Raf protein.Full length MEK1 with an...
Ligand InfoPC cidPC sid
In DepthDetails US Patent
TargetSerine/threonine-protein kinase B-raf [V600E](Homo sapiens (Human))
Novartis
US Patent
LigandPNGBDBM202822(US10245267, Example 169 | US10709712, Example 169 ...)
Affinity DataIC50:  0.775nM. Assay description: Raf and biotinylated Mek, kinase dead, were combined at 2× final concentrations in assay buffer (50 mM Tris, pH 7.5, 15 mM MgCl2, 0.01% BSA and 1 mM ...
Ligand InfoPC cidPC sid
In DepthDetails US Patent