BDBM204780 US9243002, 82
SMILES CNC(=O)c1c(oc2cc(N(C)S(C)(=O)=O)c(cc12)-c1ccc2ccn3c(cc4c(F)cccc34)c2n1)-c1ccc(F)cc1
InChI Key InChIKey=GSURGAWEPTXPFX-UHFFFAOYSA-N
Data  6 IC50  13 EC50
  Tab Delimited (TSV)   2D SDfile   Computed 3D by Vconf -m prep SDfile
Find this compound or compounds like it in BindingDB:
Activity Spreadsheet -- Enzyme Inhibition Constant Data from BindingDB
Found 19 hits for monomerid = 204780
TargetGenome polyprotein(Hepatitis C virus (HCV genotype 1a, isolate H))
Merck Sharp & Dohme
US Patent
LigandPNGBDBM204780(US9243002, 82)
Affinity DataIC50:  2.88nM. Assay description: To initiate an assay, replicon cells were plated in the presence of a dilution series of test compound in the absence of G418. Typically, the assays ...
Ligand InfoPC cidPC sid
In DepthDetails US Patent
TargetNuclear receptor subfamily 1 group I member 2(Homo sapiens (Human))
Merck
Curated by ChEMBL
LigandPNGBDBM204780(US9243002, 82)
Affinity DataEC50: >3.00E+4nM. Assay description: Transactivation of PXR (unknown origin)
Ligand InfoPC cidPC sid
In DepthDetails ArticlePubMed
TargetRNA-directed RNA polymerase(Hepatitis C virus)
Merck
Curated by ChEMBL
LigandPNGBDBM204780(US9243002, 82)
Affinity DataEC50:  6.30nM. Assay description: Inhibition of NS5B polymerase E1202G/T1280I/S2197P mutant in HCV genotype 2a infected in human HuH7 replicon cells after 72 hrs in presence of 10% FB...
Ligand InfoPC cidPC sid
In DepthDetails ArticlePubMed
TargetRNA-directed RNA polymerase(Hepatitis C virus)
Merck
Curated by ChEMBL
LigandPNGBDBM204780(US9243002, 82)
Affinity DataEC50:  30nM. Assay description: Inhibition of NS5B polymerase E1202G/T1280I/S2197P mutant in HCV genotype 1b infected in human HuH7 replicon cells after 72 hrs in presence of 50% hu...
Ligand InfoPC cidPC sid
In DepthDetails ArticlePubMed
TargetRNA-directed RNA polymerase(Hepatitis C virus)
Merck
Curated by ChEMBL
LigandPNGBDBM204780(US9243002, 82)
Affinity DataEC50:  3.5nM. Assay description: Inhibition of NS5B polymerase in HCV genotype 2B infected in HuH7 cells after 40 hrs by Taqman probe based RT-PCR analysis
Ligand InfoPC cidPC sid
In DepthDetails ArticlePubMed
TargetRNA-directed RNA polymerase(Hepatitis C virus)
Merck
Curated by ChEMBL
LigandPNGBDBM204780(US9243002, 82)
Affinity DataEC50:  1.20nM. Assay description: Inhibition of NS5B polymerase in HCV genotype 3A infected in HuH7 cells after 40 hrs by Taqman probe based RT-PCR analysis
Ligand InfoPC cidPC sid
In DepthDetails ArticlePubMed
TargetRNA-directed RNA polymerase(Hepatitis C virus)
Merck
Curated by ChEMBL
LigandPNGBDBM204780(US9243002, 82)
Affinity DataEC50:  11nM. Assay description: Inhibition of NS5B polymerase C316Y mutant in HCV genotype 1A infected in HuH7 cells after 40 hrs by Taqman probe based RT-PCR analysis
Ligand InfoPC cidPC sid
In DepthDetails ArticlePubMed
TargetRNA-directed RNA polymerase(Hepatitis C virus)
Merck
Curated by ChEMBL
LigandPNGBDBM204780(US9243002, 82)
Affinity DataEC50:  4.80nM. Assay description: Inhibition of NS5B polymerase S365A mutant in HCV genotype 1A infected in HuH7 cells after 40 hrs by Taqman probe based RT-PCR analysis
Ligand InfoPC cidPC sid
In DepthDetails ArticlePubMed
TargetVoltage-dependent L-type calcium channel subunit alpha-1C(Homo sapiens (Human))
Merck
Curated by ChEMBL
LigandPNGBDBM204780(US9243002, 82)
Affinity DataIC50:  1.80E+4nM. Assay description: Inhibition of Cav1.2 (unknown origin)
Ligand InfoPC cidPC sid
In DepthDetails ArticlePubMed
TargetSodium channel protein type 5 subunit alpha(Homo sapiens (Human))
Merck
Curated by ChEMBL
LigandPNGBDBM204780(US9243002, 82)
Affinity DataIC50: >3.00E+4nM. Assay description: Inhibition of Nav1.5 (unknown origin)
Ligand InfoPC cidPC sid
In DepthDetails ArticlePubMed
TargetRNA-directed RNA polymerase(Hepatitis C virus)
Merck
Curated by ChEMBL
LigandPNGBDBM204780(US9243002, 82)
Affinity DataEC50:  2.90nM. Assay description: Inhibition of NS5B polymerase E1202G/T1280I/S2197P mutant in HCV genotype 1a infected in human HuH7 replicon cells after 72 hrs in presence of 10% FB...
Ligand InfoPC cidPC sid
In DepthDetails ArticlePubMed
TargetRNA-directed RNA polymerase(Hepatitis C virus)
Merck
Curated by ChEMBL
LigandPNGBDBM204780(US9243002, 82)
Affinity DataEC50:  5.5nM. Assay description: Inhibition of NS5B polymerase E1202G/T1280I/S2197P mutant in HCV genotype 1b infected in human HuH7 replicon cells after 72 hrs in presence of 10% FB...
Ligand InfoPC cidPC sid
In DepthDetails ArticlePubMed
TargetRNA-directed RNA polymerase(Hepatitis C virus)
Merck
Curated by ChEMBL
LigandPNGBDBM204780(US9243002, 82)
Affinity DataEC50:  0.950nM. Assay description: Inhibition of NS5B polymerase in HCV genotype 1a infected in HuH7 cells after 40 hrs by Taqman probe based RT-PCR analysis
Ligand InfoPC cidPC sid
In DepthDetails ArticlePubMed
TargetRNA-directed RNA polymerase(Hepatitis C virus)
Merck
Curated by ChEMBL
LigandPNGBDBM204780(US9243002, 82)
Affinity DataEC50:  2.60nM. Assay description: Inhibition of NS5B polymerase in HCV genotype 1b infected in HuH7 cells after 40 hrs by Taqman probe based RT-PCR analysis
Ligand InfoPC cidPC sid
In DepthDetails ArticlePubMed
TargetCytochrome P450 3A4(Homo sapiens (Human))
Merck
Curated by ChEMBL
LigandPNGBDBM204780(US9243002, 82)
Affinity DataIC50: >5.00E+4nM. Assay description: Inhibition of CYP3A4 (unknown origin)
Ligand InfoPC cidPC sid
In DepthDetails ArticlePubMed
TargetRNA-directed RNA polymerase(Hepatitis C virus)
Merck
Curated by ChEMBL
LigandPNGBDBM204780(US9243002, 82)
Affinity DataEC50:  1.20nM. Assay description: Inhibition of NS5B polymerase in HCV genotype 4A infected in HuH7 cells after 40 hrs by Taqman probe based RT-PCR analysis
Ligand InfoPC cidPC sid
In DepthDetails ArticlePubMed
TargetPotassium voltage-gated channel subfamily H member 2(Homo sapiens (Human))
Merck
Curated by ChEMBL
LigandPNGBDBM204780(US9243002, 82)
Affinity DataIC50: >3.00E+4nM. Assay description: Inhibition of human ERG by patch clamp assay
Ligand InfoPC cidPC sid
In DepthDetails ArticlePubMed
TargetRNA-directed RNA polymerase(Hepatitis C virus)
Merck
Curated by ChEMBL
LigandPNGBDBM204780(US9243002, 82)
Affinity DataEC50:  6.70nM. Assay description: Inhibition of NS5B polymerase in HCV genotype 2A infected in HuH7 cells after 40 hrs by Taqman probe based RT-PCR analysis
Ligand InfoPC cidPC sid
In DepthDetails ArticlePubMed
TargetGenome polyprotein(Hepatitis C Virus (Virus))
Merck Sharp & Dohme
US Patent
LigandPNGBDBM204780(US9243002, 82)
Affinity DataIC50:  5.54nM. Assay description: To initiate an assay, replicon cells were plated in the presence of a dilution series of test compound in the absence of G418. Typically, the assays ...
Ligand InfoPC cidPC sid
In DepthDetails US Patent