BDBM204883 US9260454, 8
SMILES OC(=O)CN1CCN(CC1)C(=O)n1sc2ncccc2c1=O
InChI Key InChIKey=AWNYUHMSFMVGDS-UHFFFAOYSA-N
Data  1 IC50
  Tab Delimited (TSV)   2D SDfile   Computed 3D by Vconf -m prep SDfile
Find this compound or compounds like it in BindingDB:
Activity Spreadsheet -- Enzyme Inhibition Constant Data from BindingDB
Found 1 hit for monomerid = 204883
TargetProtein-glutamine gamma-glutamyltransferase 2(Homo sapiens (Human))
Sanofi
US Patent
LigandPNGBDBM204883(US9260454, 8)
Affinity DataIC50:  1.80E+4nMpH: 7.5 T: 2°C. Assay description: 2 ul of a solution of different concentrations of the test compound in dimethyl sulfoxide was added to 28 ul of buffer (50 mM TRIS, 100 mM NaCl, 10 m...
Ligand InfoPC cidPC sid
In DepthDetails US Patent