BDBM206117 US9255110, 30
SMILES COc1cc2ncccc2cc1NC(=O)c1csc2cc(CO)cnc12
InChI Key InChIKey=CDAIGUSYJLTHBH-UHFFFAOYSA-N
Data  2 IC50
  Tab Delimited (TSV)   2D SDfile   Computed 3D by Vconf -m prep SDfile
Find this compound or compounds like it in BindingDB:
Activity Spreadsheet -- Enzyme Inhibition Constant Data from BindingDB
Found 2 hits for monomerid = 206117
TargetTyrosine-protein kinase SYK(Homo sapiens (Human))
Roche Palo Alto
US Patent
LigandPNGBDBM206117(US9255110, 30)
Affinity DataIC50:  746nMpH: 7.2 T: 2°C. Assay description: SYK activity is measured by phosphorylation of a peptide substrate (Biotin-EPEGDYEEVLE) with [gamma-33P] ATP. The enzyme reaction was conducted at 20...
Ligand InfoPC cidPC sid
In DepthDetails US Patent
TargetInterleukin-1 receptor-associated kinase 4(Homo sapiens (Human))
Roche Palo Alto
US Patent
LigandPNGBDBM206117(US9255110, 30)
Affinity DataIC50:  35nM. Assay description: Purified recombinant IRAK-4 protein was incubated with 250 uM synthetic peptide(KKARFSRFAGSSPSQSSMVAR) in 30 ul of kinase buffer including (20 mM MOP...
Ligand InfoPC cidPC sid
In DepthDetails US Patent