BDBM207096 US9260439, 73
SMILES CS(=O)(=O)N1CC(C1)N1CCc2c1nc(nc2-c1cnc(N)nc1)N1CCOCC1
InChI Key InChIKey=KUFNDYYPEKYYQR-UHFFFAOYSA-N
Data  2 KI
  Tab Delimited (TSV)   2D SDfile   Computed 3D by Vconf -m prep SDfile
Find this compound or compounds like it in BindingDB:
Activity Spreadsheet -- Enzyme Inhibition Constant Data from BindingDB
Found 2 hits for monomerid = 207096
LigandPNGBDBM207096(US9260439, 73)
Affinity DataKi:  0.303nM. Assay description: PI3KA_Act: Genes encoding for full length p110alpha and p85alpha nSH-iSH2=niSH2 (p85a aminoacids 322-600) subunits of PI3Kalpha complex were subclone...
Ligand InfoPC cidPC sid
In DepthDetails US Patent
LigandPNGBDBM207096(US9260439, 73)
Affinity DataKi:  0.350nM. Assay description: PI3KA_FL: Genes encoding for full length p110alpha and p85alpha subunits of PI3Kalpha complex were subcloned from existing constructs into pFASTBAC D...
Ligand InfoPC cidPC sid
In DepthDetails US Patent