BDBM207566 US10501467, Example 11::US9260440, 11::US9617273, Example 11
SMILES CC(C)C1Cc2[nH]c3cc(F)cc4c3c2c(C1)n[nH]c4=O
InChI Key InChIKey=HYNAPDOTRWQEEH-UHFFFAOYSA-N
Data  8 IC50  1 EC50
  Tab Delimited (TSV)   2D SDfile   Computed 3D by Vconf -m prep SDfile
Find this compound or compounds like it in BindingDB:
Activity Spreadsheet -- Enzyme Inhibition Constant Data from BindingDB
Found 9 hits for monomerid = 207566
TargetPoly [ADP-ribose] polymerase 1(Homo sapiens (Human))
Beigene
US Patent
LigandPNGBDBM207566(US10501467, Example 11 | US9260440, 11 | US9617273...)
Affinity DataIC50:  3.30nMpH: 8.0Assay Description:PARP-1 enzymatic assay was conducted using a method modified from HT F Homogeneous PARP Inhibition Assay Kit (Trevigen). 8.8 nM PARP-1 was pre-incuba...
Ligand InfoPC cidPC sid
In DepthDetails US Patent
TargetPoly [ADP-ribose] polymerase tankyrase-2(Homo sapiens (Human))
Beigene
US Patent
LigandPNGBDBM207566(US10501467, Example 11 | US9260440, 11 | US9617273...)
Affinity DataIC50:  29nM. Assay description: Tankyrase-2 enzymatic assay was conducted using commercial Tankyrase-2 Chemiluminescent Assay Kit (BPS Biosciences) and the protocol with the kit. GS...
Ligand InfoPC cidPC sid
In DepthDetails US Patent
TargetPoly [ADP-ribose] polymerase 1(Homo sapiens (Human))
Beigene
US Patent
LigandPNGBDBM207566(US10501467, Example 11 | US9260440, 11 | US9617273...)
Affinity DataIC50:  3.30E+3nM. Assay description: PARP-1 enzymatic assay was conducted using a method modified from HT F Homogeneous PARP Inhibition Assay Kit (Trevigen). 8.8 nM PARP-1 was pre-incuba...
Ligand InfoPC cidPC sid
In DepthDetails US Patent
TargetPoly [ADP-ribose] polymerase tankyrase-2(Homo sapiens (Human))
Beigene
US Patent
LigandPNGBDBM207566(US10501467, Example 11 | US9260440, 11 | US9617273...)
Affinity DataIC50:  2.90E+4nM. Assay description: Tankyrase-2 enzymatic assay was conducted using commercial Tankyrase-2 Chemiluminescent Assay Kit (BPS Biosciences) and the protocol with the kit. GS...
Ligand InfoPC cidPC sid
In DepthDetails US Patent
TargetPoly [ADP-ribose] polymerase 1(Homo sapiens (Human))
Beigene
US Patent
LigandPNGBDBM207566(US10501467, Example 11 | US9260440, 11 | US9617273...)
Affinity DataIC50:  3.30nM. Assay description: Inhibition of human PARP-1 catalytic domain (662 to 1011 residues) expressed in Escherichia coli BL21(DE3) cells pre-incubated for 30 mins before add...
Ligand InfoPC cidPC sid
In DepthDetails ArticlePubMed
TargetPoly [ADP-ribose] polymerase tankyrase-2(Homo sapiens (Human))
Beigene
US Patent
LigandPNGBDBM207566(US10501467, Example 11 | US9260440, 11 | US9617273...)
Affinity DataIC50:  2.90E+4nM. Assay description: Tankyrase-2 enzymatic assay was conducted using commercial Tankyrase-2 Chemiluminescent Assay Kit (BPS Biosciences) and the protocol with the kit. GS...
Ligand InfoPC cidPC sid
In DepthDetails US Patent
TargetPoly [ADP-ribose] polymerase 1(Homo sapiens (Human))
Beigene
US Patent
LigandPNGBDBM207566(US10501467, Example 11 | US9260440, 11 | US9617273...)
Affinity DataEC50:  2.40nM. Assay description: Inhibition of PARP-1 in human HeLa cells incubated for 18 hrs in presence of H2O2
Ligand InfoPC cidPC sid
In DepthDetails ArticlePubMed
TargetPoly [ADP-ribose] polymerase 2(Homo sapiens (Human))
TBA
Curated by ChEMBL
LigandPNGBDBM207566(US10501467, Example 11 | US9260440, 11 | US9617273...)
Affinity DataIC50:  0.700nM. Assay description: Inhibition of PARP-2 (unknown origin) pre-incubated for 30 mins before addition of activated DNA and NAD by chemiluminescent assay
Ligand InfoPC cidPC sid
In DepthDetails ArticlePubMed
TargetPoly [ADP-ribose] polymerase 1(Homo sapiens (Human))
Beigene
US Patent
LigandPNGBDBM207566(US10501467, Example 11 | US9260440, 11 | US9617273...)
Affinity DataIC50:  3.30E+3nM. Assay description: PARP-1 enzymatic assay was conducted using a method modified from HT F Homogeneous PARP Inhibition Assay Kit (Trevigen). 8.8 nM PARP-1 was pre-incuba...
Ligand InfoPC cidPC sid
In DepthDetails US Patent