BDBM207569 US10501467, Example 19::US9260440, 14::US9260440, 19::US9617273, Example 19
SMILES CC1(C)CCc2[nH]c3cc(F)cc4c3c2c1n[nH]c4=O
InChI Key InChIKey=UCDKHNXJMSHBER-UHFFFAOYSA-N
Data  13 IC50  1 EC50
  Tab Delimited (TSV)   2D SDfile   Computed 3D by Vconf -m prep SDfile
Find this compound or compounds like it in BindingDB:
Activity Spreadsheet -- Enzyme Inhibition Constant Data from BindingDB
Found 14 hits for monomerid = 207569
TargetPoly [ADP-ribose] polymerase 1(Homo sapiens (Human))
Beigene
US Patent
LigandPNGBDBM207569(US10501467, Example 19 | US9260440, 14 | US9260440...)
Affinity DataIC50:  5.20nMpH: 8.0Assay Description:PARP-1 enzymatic assay was conducted using a method modified from HT F Homogeneous PARP Inhibition Assay Kit (Trevigen). 8.8 nM PARP-1 was pre-incuba...
Ligand InfoPC cidPC sid
In DepthDetails US Patent
TargetPoly [ADP-ribose] polymerase 1(Homo sapiens (Human))
Beigene
US Patent
LigandPNGBDBM207569(US10501467, Example 19 | US9260440, 14 | US9260440...)
Affinity DataIC50:  5.20nMpH: 8.0Assay Description:PARP-1 enzymatic assay was conducted using a method modified from HT F Homogeneous PARP Inhibition Assay Kit (Trevigen). 8.8 nM PARP-1 was pre-incuba...
Ligand InfoPC cidPC sid
In DepthDetails US Patent
TargetPoly [ADP-ribose] polymerase 2(Homo sapiens (Human))
Beigene
US Patent
LigandPNGBDBM207569(US10501467, Example 19 | US9260440, 14 | US9260440...)
Affinity DataIC50:  0.700nM. Assay description: PARP-2 and PARP-3 enzymatic assays were conducted using commercial PARP-2/PARP-3 Chemiluminescent Assay Kit (BPS Biosciences) and the protocols with ...
Ligand InfoPC cidPC sid
In DepthDetails US Patent
TargetPoly [ADP-ribose] polymerase 2(Homo sapiens (Human))
Beigene
US Patent
LigandPNGBDBM207569(US10501467, Example 19 | US9260440, 14 | US9260440...)
Affinity DataIC50:  0.700nM. Assay description: PARP-2 and PARP-3 enzymatic assays were conducted using commercial PARP-2/PARP-3 Chemiluminescent Assay Kit (BPS Biosciences) and the protocols with ...
Ligand InfoPC cidPC sid
In DepthDetails US Patent
TargetPoly [ADP-ribose] polymerase 1(Homo sapiens (Human))
Beigene
US Patent
LigandPNGBDBM207569(US10501467, Example 19 | US9260440, 14 | US9260440...)
Affinity DataIC50:  5.20E+3nM. Assay description: PARP-1 enzymatic assay was conducted using a method modified from HT F Homogeneous PARP Inhibition Assay Kit (Trevigen). 8.8 nM PARP-1 was pre-incuba...
Ligand InfoPC cidPC sid
In DepthDetails US Patent
TargetPoly [ADP-ribose] polymerase 2(Homo sapiens (Human))
Beigene
US Patent
LigandPNGBDBM207569(US10501467, Example 19 | US9260440, 14 | US9260440...)
Affinity DataIC50:  700nM. Assay description: PARP-2 and PARP-3 enzymatic assays were conducted using commercial PARP-2/PARP-3 Chemiluminescent Assay Kit (BPS Biosciences) and the protocols with ...
Ligand InfoPC cidPC sid
In DepthDetails US Patent
TargetPoly [ADP-ribose] polymerase 1(Homo sapiens (Human))
Beigene
US Patent
LigandPNGBDBM207569(US10501467, Example 19 | US9260440, 14 | US9260440...)
Affinity DataIC50:  29nM. Assay description: Inhibition of human PARP-1 catalytic domain (662 to 1011 residues) expressed in Escherichia coli BL21(DE3) cells pre-incubated for 30 mins before add...
Ligand InfoPC cidPC sid
In DepthDetails ArticlePubMed
TargetPoly [ADP-ribose] polymerase 2(Homo sapiens (Human))
Beigene
US Patent
LigandPNGBDBM207569(US10501467, Example 19 | US9260440, 14 | US9260440...)
Affinity DataIC50:  700nM. Assay description: PARP-2 and PARP-3 enzymatic assays were conducted using commercial PARP-2/PARP-3 Chemiluminescent Assay Kit (BPS Biosciences) and the protocols with ...
Ligand InfoPC cidPC sid
In DepthDetails US Patent
TargetPoly [ADP-ribose] polymerase 1(Homo sapiens (Human))
Beigene
US Patent
LigandPNGBDBM207569(US10501467, Example 19 | US9260440, 14 | US9260440...)
Affinity DataIC50:  5.20E+3nM. Assay description: PARP-1 enzymatic assay was conducted using a method modified from HT F Homogeneous PARP Inhibition Assay Kit (Trevigen). 8.8 nM PARP-1 was pre-incuba...
Ligand InfoPC cidPC sid
In DepthDetails US Patent
TargetPoly [ADP-ribose] polymerase 2(Homo sapiens (Human))
Beigene
US Patent
LigandPNGBDBM207569(US10501467, Example 19 | US9260440, 14 | US9260440...)
Affinity DataIC50:  700nM. Assay description: PARP-2 and PARP-3 enzymatic assays were conducted using commercial PARP-2/PARP-3 Chemiluminescent Assay Kit (BPS Biosciences) and the protocols with ...
Ligand InfoPC cidPC sid
In DepthDetails US Patent
TargetPoly [ADP-ribose] polymerase 1(Homo sapiens (Human))
Beigene
US Patent
LigandPNGBDBM207569(US10501467, Example 19 | US9260440, 14 | US9260440...)
Affinity DataIC50:  5.20E+3nM. Assay description: PARP-1 enzymatic assay was conducted using a method modified from HT F Homogeneous PARP Inhibition Assay Kit (Trevigen). 8.8 nM PARP-1 was pre-incuba...
Ligand InfoPC cidPC sid
In DepthDetails US Patent
TargetPoly [ADP-ribose] polymerase 2(Homo sapiens (Human))
Beigene
US Patent
LigandPNGBDBM207569(US10501467, Example 19 | US9260440, 14 | US9260440...)
Affinity DataIC50:  700nM. Assay description: PARP-2 and PARP-3 enzymatic assays were conducted using commercial PARP-2/PARP-3 Chemiluminescent Assay Kit (BPS Biosciences) and the protocols with ...
Ligand InfoPC cidPC sid
In DepthDetails US Patent
TargetPoly [ADP-ribose] polymerase 1(Homo sapiens (Human))
Beigene
US Patent
LigandPNGBDBM207569(US10501467, Example 19 | US9260440, 14 | US9260440...)
Affinity DataEC50:  46nM. Assay description: Inhibition of PARP-1 in human HeLa cells incubated for 18 hrs in presence of H2O2
Ligand InfoPC cidPC sid
In DepthDetails ArticlePubMed
TargetPoly [ADP-ribose] polymerase 1(Homo sapiens (Human))
Beigene
US Patent
LigandPNGBDBM207569(US10501467, Example 19 | US9260440, 14 | US9260440...)
Affinity DataIC50:  5.20E+3nM. Assay description: PARP-1 enzymatic assay was conducted using a method modified from HT F Homogeneous PARP Inhibition Assay Kit (Trevigen). 8.8 nM PARP-1 was pre-incuba...
Ligand InfoPC cidPC sid
In DepthDetails US Patent