BDBM207592 US10501467, Example 37::US9260440, 37::US9617273, Example 37
SMILES CN(C)CCn1c2CCCc3n[nH]c(=O)c4cccc1c4c23
InChI Key InChIKey=CIRNFRVHNPNZGP-UHFFFAOYSA-N
Data  4 IC50  1 EC50
  Tab Delimited (TSV)   2D SDfile   Computed 3D by Vconf -m prep SDfile
Find this compound or compounds like it in BindingDB:
Activity Spreadsheet -- Enzyme Inhibition Constant Data from BindingDB
Found 5 hits for monomerid = 207592
TargetPoly [ADP-ribose] polymerase 1(Homo sapiens (Human))
Beigene
US Patent
LigandPNGBDBM207592(US10501467, Example 37 | US9260440, 37 | US9617273...)
Affinity DataIC50:  15nMpH: 8.0Assay Description:PARP-1 enzymatic assay was conducted using a method modified from HT F Homogeneous PARP Inhibition Assay Kit (Trevigen). 8.8 nM PARP-1 was pre-incuba...
Ligand InfoPC cidPC sid
In DepthDetails US Patent
TargetPoly [ADP-ribose] polymerase 1(Homo sapiens (Human))
Beigene
US Patent
LigandPNGBDBM207592(US10501467, Example 37 | US9260440, 37 | US9617273...)
Affinity DataIC50:  1.50E+4nM. Assay description: PARP-1 enzymatic assay was conducted using a method modified from HT F Homogeneous PARP Inhibition Assay Kit (Trevigen). 8.8 nM PARP-1 was pre-incuba...
Ligand InfoPC cidPC sid
In DepthDetails US Patent
TargetPoly [ADP-ribose] polymerase 1(Homo sapiens (Human))
Beigene
US Patent
LigandPNGBDBM207592(US10501467, Example 37 | US9260440, 37 | US9617273...)
Affinity DataIC50:  15nM. Assay description: Inhibition of human PARP-1 catalytic domain (662 to 1011 residues) expressed in Escherichia coli BL21(DE3) cells pre-incubated for 30 mins before add...
Ligand InfoPC cidPC sid
In DepthDetails ArticlePubMed
TargetPoly [ADP-ribose] polymerase 1(Homo sapiens (Human))
Beigene
US Patent
LigandPNGBDBM207592(US10501467, Example 37 | US9260440, 37 | US9617273...)
Affinity DataEC50:  14nM. Assay description: Inhibition of PARP-1 in human HeLa cells incubated for 18 hrs in presence of H2O2
Ligand InfoPC cidPC sid
In DepthDetails ArticlePubMed
TargetPoly [ADP-ribose] polymerase 1(Homo sapiens (Human))
Beigene
US Patent
LigandPNGBDBM207592(US10501467, Example 37 | US9260440, 37 | US9617273...)
Affinity DataIC50:  1.50E+4nM. Assay description: PARP-1 enzymatic assay was conducted using a method modified from HT F Homogeneous PARP Inhibition Assay Kit (Trevigen). 8.8 nM PARP-1 was pre-incuba...
Ligand InfoPC cidPC sid
In DepthDetails US Patent