BDBM20762 9-butyl-8-[(6,7-dichloro-1,3-benzothiazol-2-yl)sulfanyl]-9H-purin-6-amine::Benzothiazole analogue, 15
SMILES CCCCn1c(Sc2nc3ccc(Cl)c(Cl)c3s2)nc2c(N)ncnc12
InChI Key InChIKey=IEFZISRPMLUIFT-UHFFFAOYSA-N
Data  1 EC50
  Tab Delimited (TSV)   2D SDfile   Computed 3D by Vconf -m prep SDfile
Find this compound or compounds like it in BindingDB:
Activity Spreadsheet -- Enzyme Inhibition Constant Data from BindingDB
Found 1 hit for monomerid = 20762
TargetHeat shock protein HSP 90-beta(Homo sapiens (Human))
Conforma Therapeutics
LigandPNGBDBM20762(9-butyl-8-[(6,7-dichloro-1,3-benzothiazol-2-yl)sul...)
Affinity DataEC50:  2.50E+4nMpH: 7.2 T: 2°C. Assay description: EC50 was defined as the concentration of the compound at which there was 50% degradation of the Her-2/neu protein in MCF7 breast carcinoma cells. Sam...
In DepthDetails ArticlePubMed